Facebook
From Melodic Tern, 1 Year ago, written in Plain Text.
Embed
Download Paste or View Raw
Hits: 241
  1. PLATFORM_VERSION_CODENAME=REL
  2. PLATFORM_VERSION=9
  3. TARGET_PRODUCT=pa_beryllium
  4. TARGET_BUILD_VARIANT=user
  5. TARGET_BUILD_TYPE=release
  6. TARGET_ARCH=arm64
  7. TARGET_ARCH_VARIANT=armv8-a
  8. TARGET_CPU_VARIANT=kryo300
  9. TARGET_2ND_ARCH=arm
  10. TARGET_2ND_ARCH_VARIANT=armv8-a
  11. TARGET_2ND_CPU_VARIANT=cortex-a75
  12. HOST_ARCH=x86_64
  13. HOST_2ND_ARCH=x86
  14. HOST_OS=linux
  15. HOST_OS_EXTRA=Linux-4.15.0-1047-gcp-x86_64-Ubuntu-16.04.6-LTS
  16. HOST_CROSS_OS=windows
  17. HOST_CROSS_ARCH=x86
  18. HOST_CROSS_2ND_ARCH=x86_64
  19. HOST_BUILD_TYPE=release
  20. BUILD_ID=PKQ1.190806.001
  21. OUT_DIR=/home/jayamadhuri6/pa/out
  22. ============================================
  23. QSSI: not enabled for pa_beryllium target as /release/QSSI/QSSI_enforced_targets_list.txt was not found.
  24. [1/1] /home/jayamadhuri6/pa/out/soong/.minibootstrap/minibp /home/jayamadhuri6/pa/out/soong/.bootstrap/build.ninja
  25. [1/1] /home/jayamadhuri6/pa/out/soong/.bootstrap/bin/soong_build /home/jayamadhuri6/pa/out/soong/build.ninja
  26. Clang SA is not enabled
  27. /home/jayamadhuri6/pa/out/build-pa_beryllium-dist-cleanspec.ninja is missing, regenerating...
  28. /home/jayamadhuri6/pa/out/build-pa_beryllium-dist.ninja is missing, regenerating...
  29. [25/986] including development/build/Android.mk ...
  30. development/build/build_android_stubs.mk:43: warning: android_stubs_current
  31. development/build/build_android_stubs.mk:43: warning: metalava_android_stubs_current metalava_android_stubs_current
  32. development/build/build_android_stubs.mk:43: warning: android_system_stubs_current
  33. development/build/build_android_stubs.mk:43: warning: android_test_stubs_current
  34. development/build/build_android_stubs.mk:43: warning: metalava_android_system_stubs_current metalava_android_system_stubs_current
  35. development/build/build_android_stubs.mk:43: warning: metalava_android_test_stubs_current metalava_android_test_stubs_current
  36. [353/986] including hardware/qcom/media/Android.mk ...
  37. srik sdm845
  38. [363/986] including packages/apps/Bluetooth/Android.mk ...
  39. find: ‘../../../vendor/qcom/opensource/bluetooth_ext/packages_apps_bluetooth_ext/src’: No such file or directory
  40. [542/986] including system/sepolicy/Android.mk ...
  41. system/sepolicy/Android.mk:79: warning: BOARD_SEPOLICY_VERS not specified, assuming current platform version
  42. [986/986] including vendor/xiaomi/whyred/Android.mk ...
  43. external/nos/host/android/hals/keymaster/citadel/Android.mk: error: android.hardware.keymaster@4.0-service.citadel (EXECUTABLES android-arm64) missing libkeymasterprovision (SHARED_LIBRARIES android-arm64)
  44. You can set ALLOW_MISSING_DEPENDENCIES=true in your environment if this is intentional, but that may defer real problems until later in the build.
  45. external/nos/host/android/hals/keymaster/citadel/Android.mk: error: android.hardware.keymaster@4.0-service.citadel (EXECUTABLES android-arm64) missing libkeymasterutils (SHARED_LIBRARIES android-arm64)
  46. You can set ALLOW_MISSING_DEPENDENCIES=true in your environment if this is intentional, but that may defer real problems until later in the build.
  47. external/nos/host/android/hals/keymaster/citadel/Android.mk: error: android.hardware.keymaster@4.0-service.citadel (EXECUTABLES android-arm64) missing libkeymasterdeviceutils (SHARED_LIBRARIES android-arm64)
  48. You can set ALLOW_MISSING_DEPENDENCIES=true in your environment if this is intentional, but that may defer real problems until later in the build.
  49. external/nos/host/android/hals/keymaster/citadel/Android.mk: error: android.hardware.keymaster@4.0-service.citadel (EXECUTABLES android-arm64) missing libQSEEComAPI (SHARED_LIBRARIES android-arm64)
  50. You can set ALLOW_MISSING_DEPENDENCIES=true in your environment if this is intentional, but that may defer real problems until later in the build.
  51. hardware/qcom/media/mm-video-v4l2/vidc/venc/Android.mk: error: libOmxSwVencMpeg4 (SHARED_LIBRARIES android-arm64) missing libMpeg4SwEncoder (SHARED_LIBRARIES android-arm64)
  52. You can set ALLOW_MISSING_DEPENDENCIES=true in your environment if this is intentional, but that may defer real problems until later in the build.
  53. hardware/qcom/media/mm-video-v4l2/vidc/venc/Android.mk: error: libOmxSwVencMpeg4 (SHARED_LIBRARIES android-arm) missing libMpeg4SwEncoder (SHARED_LIBRARIES android-arm)
  54. You can set ALLOW_MISSING_DEPENDENCIES=true in your environment if this is intentional, but that may defer real problems until later in the build.
  55. system/chre/host/msm/Android.mk: error: chre (EXECUTABLES android-arm64) missing libsdsprpc (SHARED_LIBRARIES android-arm64)
  56. You can set ALLOW_MISSING_DEPENDENCIES=true in your environment if this is intentional, but that may defer real problems until later in the build.
  57. build/make/core/main.mk:837: error: exiting from previous errors.
  58. 14:39:57 ckati failed with: exit status 1
  59. #### failed to build some targets (01:03 (mm:ss)) ####
  60. Build failed!