Facebook
From Drupin, 8 Months ago, written in Bash.
Embed
Download Paste or View Raw
Hits: 110
  1. $make
  2. Making all in srclib
  3. make[1]: Entering directory '/usr/local/httpd/srclib'
  4. make[1]: Leaving directory '/usr/local/httpd/srclib'
  5. Making all in os
  6. make[1]: Entering directory '/usr/local/httpd/os'
  7. Making all in win32
  8. make[2]: Entering directory '/usr/local/httpd/os/win32'
  9. make[3]: Entering directory '/usr/local/httpd/os/win32'
  10. /mingw64/share/apr-1/build/libtool --silent --mode=compile gcc      -DAP_DECLARE_EXPORT  -DWIN32 -D__MSVCRT__ -D_LARGEFILE64_SOURCE     -I. -I/usr/local/httpd/os/win32 -I/usr/local/httpd/include -I/mingw64/include/apr-1 -I/mingw64/include -I/usr/local/httpd/modules/aaa -I/usr/local/httpd/modules/cache -I/usr/local/httpd/modules/core -I/usr/local/httpd/modules/database -I/usr/local/httpd/modules/filters -I/usr/local/httpd/modules/ldap -I/usr/local/httpd/modules/loggers -I/usr/local/httpd/modules/lua -I/usr/local/httpd/modules/proxy -I/usr/local/httpd/modules/http2 -I/usr/local/httpd/modules/session -I/usr/local/httpd/modules/ssl -I/usr/local/httpd/modules/test -I/usr/local/httpd/server -I/usr/local/httpd/modules/md -I/usr/local/httpd/modules/arch/unix -I/usr/local/httpd/modules/dav/main -I/usr/local/httpd/modules/generators -I/usr/local/httpd/modules/mappers  -prefer-non-pic -static -c util_win32.c && touch util_win32.lo
  11. util_win32.c:18:10: fatal error: arch/win32/apr_arch_file_io.h: No such file or directory
  12.    18 | #include "arch/win32/apr_arch_file_io.h"
  13.       |          ^~~~~~~~~~~~~~~~~~~~~~~~~~~~~~~
  14. compilation terminated.
  15. make[3]: *** [/usr/local/httpd/build/rules.mk:206: util_win32.lo] Error 1
  16. make[3]: Leaving directory '/usr/local/httpd/os/win32'
  17. make[2]: *** [/usr/local/httpd/build/rules.mk:75: all-recursive] Error 1
  18. make[2]: Leaving directory '/usr/local/httpd/os/win32'
  19. make[1]: *** [/usr/local/httpd/build/rules.mk:75: all-recursive] Error 1
  20. make[1]: Leaving directory '/usr/local/httpd/os'
  21. make: *** [/usr/local/httpd/build/rules.mk:75: all-recursive] Error 1
  22.  
  23.