Facebook
From Juest, 1 Year ago, written in Plain Text.
Embed
Download Paste or View Raw
Hits: 293
  1. **********************************************************************
  2. ** Visual Studio 2017 Developer Command Prompt v15.9.56
  3. ** Copyright (c) 2017 Microsoft Corporation
  4. **********************************************************************
  5. [vcvarsall.bat] Environment initialized for: 'x86'
  6. ==============================
  7. Building PDCurses
  8. ==============================
  9.  
  10. Microsoft (R) Program Maintenance Utility Version 14.16.27050.0
  11. Copyright (C) Microsoft Corporation.  All rights reserved.
  12.  
  13. 'pdcurses.lib' is up-to-date
  14. winconpdcurses.lib
  15.         1 file(s) copied.
  16. curses.h
  17. curspriv.h
  18. panel.h
  19.         3 file(s) copied.
  20.         1 file(s) copied.
  21.  
  22. ==============================
  23. Building zlib
  24. ==============================
  25.  
  26. Microsoft (R) Program Maintenance Utility Version 14.16.27050.0
  27. Copyright (C) Microsoft Corporation.  All rights reserved.
  28.  
  29.         cl -c -D_CRT_SECURE_NO_DEPRECATE -D_CRT_NONSTDC_NO_DEPRECATE -nologo -MD -W3 -O2 -Oy- -Zi -Fd"zlib"  .adler32.c
  30. adler32.c
  31.         cl -c -D_CRT_SECURE_NO_DEPRECATE -D_CRT_NONSTDC_NO_DEPRECATE -nologo -MD -W3 -O2 -Oy- -Zi -Fd"zlib"  .compress.c
  32. compress.c
  33.         cl -c -D_CRT_SECURE_NO_DEPRECATE -D_CRT_NONSTDC_NO_DEPRECATE -nologo -MD -W3 -O2 -Oy- -Zi -Fd"zlib"  .crc32.c
  34. crc32.c
  35.         cl -c -D_CRT_SECURE_NO_DEPRECATE -D_CRT_NONSTDC_NO_DEPRECATE -nologo -MD -W3 -O2 -Oy- -Zi -Fd"zlib"  .deflate.c
  36. deflate.c
  37.         cl -c -D_CRT_SECURE_NO_DEPRECATE -D_CRT_NONSTDC_NO_DEPRECATE -nologo -MD -W3 -O2 -Oy- -Zi -Fd"zlib"  .gzclose.c
  38. gzclose.c
  39.         cl -c -D_CRT_SECURE_NO_DEPRECATE -D_CRT_NONSTDC_NO_DEPRECATE -nologo -MD -W3 -O2 -Oy- -Zi -Fd"zlib"  .gzlib.c
  40. gzlib.c
  41.         cl -c -D_CRT_SECURE_NO_DEPRECATE -D_CRT_NONSTDC_NO_DEPRECATE -nologo -MD -W3 -O2 -Oy- -Zi -Fd"zlib"  .gzread.c
  42. gzread.c
  43.         cl -c -D_CRT_SECURE_NO_DEPRECATE -D_CRT_NONSTDC_NO_DEPRECATE -nologo -MD -W3 -O2 -Oy- -Zi -Fd"zlib"  .gzwrite.c
  44. gzwrite.c
  45.         cl -c -D_CRT_SECURE_NO_DEPRECATE -D_CRT_NONSTDC_NO_DEPRECATE -nologo -MD -W3 -O2 -Oy- -Zi -Fd"zlib"  .infback.c
  46. infback.c
  47.         cl -c -D_CRT_SECURE_NO_DEPRECATE -D_CRT_NONSTDC_NO_DEPRECATE -nologo -MD -W3 -O2 -Oy- -Zi -Fd"zlib"  .inflate.c
  48. inflate.c
  49.         cl -c -D_CRT_SECURE_NO_DEPRECATE -D_CRT_NONSTDC_NO_DEPRECATE -nologo -MD -W3 -O2 -Oy- -Zi -Fd"zlib"  .inftrees.c
  50. inftrees.c
  51.         cl -c -D_CRT_SECURE_NO_DEPRECATE -D_CRT_NONSTDC_NO_DEPRECATE -nologo -MD -W3 -O2 -Oy- -Zi -Fd"zlib"  .inffast.c
  52. inffast.c
  53.         cl -c -D_CRT_SECURE_NO_DEPRECATE -D_CRT_NONSTDC_NO_DEPRECATE -nologo -MD -W3 -O2 -Oy- -Zi -Fd"zlib"  .trees.c
  54. trees.c
  55.         cl -c -D_CRT_SECURE_NO_DEPRECATE -D_CRT_NONSTDC_NO_DEPRECATE -nologo -MD -W3 -O2 -Oy- -Zi -Fd"zlib"  .uncompr.c
  56. uncompr.c
  57.         cl -c -D_CRT_SECURE_NO_DEPRECATE -D_CRT_NONSTDC_NO_DEPRECATE -nologo -MD -W3 -O2 -Oy- -Zi -Fd"zlib"  .zutil.c
  58. zutil.c
  59.         rc /dWIN32 /r /fozlib1.res ./win32/zlib1.rc
  60. Microsoft (R) Windows (R) Resource Compiler Version 10.0.10011.16384
  61. Copyright (C) Microsoft Corporation.  All rights reserved.
  62.  
  63.         link -nologo -debug -incremental:no -opt:ref -def:./win32/zlib.def -dll -implib:zdll.lib  -out:zlib1.dll -base:0x5A4C0000 adler32.obj compress.obj crc32.obj deflate.obj gzclose.obj gzlib.obj gzread.obj  gzwrite.obj infback.obj inflate.obj inftrees.obj inffast.obj trees.obj uncompr.obj zutil.obj  zlib1.res
  64.    Creating library zdll.lib and object zdll.exp
  65. LINK : fatal error LNK1207: incompatible PDB format in 'Z:bzflag-dependenciessrczlibzlib1.pdb'; delete and rebuild
  66. NMAKE : fatal error U1077: '"C:Program Files (x86)Microsoft Visual Studio2017EnterpriseVCToolsMSVC14.16.27023binHostX86x86link.EXE"' : return code '0x4b7'
  67. Stop.
  68.  
  69. ==============================
  70. Building c-ares
  71. ==============================
  72.  
  73. Microsoft (R) Program Maintenance Utility Version 14.16.27050.0
  74. Copyright (C) Microsoft Corporation.  All rights reserved.
  75.  
  76.         link.exe /dll /nologo /incremental:no /fixed:no /release ws2_32.lib advapi32.lib kernel32.lib iphlpapi.lib /implib:.msvccaresdll-releasecares.lib  /out:.msvccaresdll-releasecares.dll .msvccaresdll-releaseobjares__addrinfo2hostent.obj .msvccaresdll-releaseobjares__addrinfo_localhost.obj .msvccaresdll-releaseobjares__close_sockets.obj .msvccaresdll-releaseobjares__get_hostent.obj .msvccaresdll-releaseobjares__parse_into_addrinfo.obj .msvccaresdll-releaseobjares__readaddrinfo.obj .msvccaresdll-releaseobjares__sortaddrinfo.obj .msvccaresdll-releaseobjares__read_line.obj .msvccaresdll-releaseobjares__timeval.obj .msvccaresdll-releaseobjares_android.obj .msvccaresdll-releaseobjares_cancel.obj .msvccaresdll-releaseobjares_data.obj .msvccaresdll-releaseobjares_destroy.obj .msvccaresdll-releaseobjares_expand_name.obj .msvccaresdll-releaseobjares_expand_string.obj .msvccaresdll-releaseobjares_fds.obj .msvccaresdll-releaseobjares_free_hostent.obj .msvccaresdll-releaseobjares_free_string.obj .msvccaresdll-releaseobjares_freeaddrinfo.obj .msvccaresdll-releaseobjares_getaddrinfo.obj .msvccaresdll-releaseobjares_getenv.obj .msvccaresdll-releaseobjares_gethostbyaddr.obj .msvccaresdll-releaseobjares_gethostbyname.obj .msvccaresdll-releaseobjares_getnameinfo.obj .msvccaresdll-releaseobjares_getsock.obj .msvccaresdll-releaseobjares_init.obj .msvccaresdll-releaseobjares_library_init.obj .msvccaresdll-releaseobjares_llist.obj .msvccaresdll-releaseobjares_mkquery.obj .msvccaresdll-releaseobjares_create_query.obj .msvccaresdll-releaseobjares_nowarn.obj .msvccaresdll-releaseobjares_options.obj .msvccaresdll-releaseobjares_parse_a_reply.obj .msvccaresdll-releaseobjares_parse_aaaa_reply.obj .msvccaresdll-releaseobjares_parse_caa_reply.obj .msvccaresdll-releaseobjares_parse_mx_reply.obj .msvccaresdll-releaseobjares_parse_naptr_reply.obj .msvccaresdll-releaseobjares_parse_ns_reply.obj .msvccaresdll-releaseobjares_parse_ptr_reply.obj .msvccaresdll-releaseobjares_parse_soa_reply.obj .msvccaresdll-releaseobjares_parse_srv_reply.obj .msvccaresdll-releaseobjares_parse_txt_reply.obj .msvccaresdll-releaseobjares_parse_uri_reply.obj .msvccaresdll-releaseobjares_platform.obj .msvccaresdll-releaseobjares_process.obj .msvccaresdll-releaseobjares_query.obj .msvccaresdll-releaseobjares_rand.obj .msvccaresdll-releaseobjares_search.obj .msvccaresdll-releaseobjares_send.obj .msvccaresdll-releaseobjares_strcasecmp.obj .msvccaresdll-releaseobjares_strdup.obj .msvccaresdll-releaseobjares_strerror.obj .msvccaresdll-releaseobjares_strsplit.obj .msvccaresdll-releaseobjares_timeout.obj .msvccaresdll-releaseobjares_version.obj .msvccaresdll-releaseobjares_writev.obj .msvccaresdll-releaseobjbitncmp.obj .msvccaresdll-releaseobjinet_net_pton.obj .msvccaresdll-releaseobjinet_ntop.obj .msvccaresdll-releaseobjwindows_port.obj .msvccaresdll-releaseobjcares.res
  77.    Creating library .msvccaresdll-releasecares.lib and object .msvccaresdll-releasecares.exp
  78. includeares.h
  79. includeares_build.h
  80. includeares_dns.h
  81. includeares_nameser.h
  82. includeares_rules.h
  83. includeares_version.h
  84.         6 file(s) copied.
  85. msvccaresdll-releasecares.dll
  86.         1 file(s) copied.
  87. msvccaresdll-releasecares.lib
  88.         1 file(s) copied.
  89. msvccaresdll-releasecares.exp
  90.         1 file(s) copied.
  91.         1 file(s) copied.
  92.  
  93. ==============================
  94. Building libcurl
  95. ==============================
  96.  
  97. Microsoft (R) Program Maintenance Utility Version 14.16.27050.0
  98. Copyright (C) Microsoft Corporation.  All rights reserved.
  99.  
  100. configuration name: libcurl-vc15-x86-release-dll-cares-dll-zlib-dll-ipv6-sspi-schannel
  101.         cl /O2 /DNDEBUG /MD /I. /I ../lib /I../include /nologo /W4 /EHsc /DWIN32 /FD /c /DBUILDING_LIBCURL /I"Z:bzflag-dependenciesoutput-release-x86/include" /DUSE_ARES /I"Z:bzflag-dependenciesoutput-release-x86/include/cares" /DHAVE_LIBZ  /I"Z:bzflag-dependenciesoutput-release-x86/include"  /DUSE_IPV6  /DUSE_WINDOWS_SSPI /DUSE_SCHANNEL /Fo"..buildslibcurl-vc15-x86-release-dll-cares-dll-zlib-dll-ipv6-sspi-schannel-obj-lib"  ..libversion.c
  102. version.c
  103. ..libversion.c(61): fatal error C1083: Cannot open include file: 'zlib.h': No such file or directory
  104. NMAKE : fatal error U1077: '"C:Program Files (x86)Microsoft Visual Studio2017EnterpriseVCToolsMSVC14.16.27023binHostX86x86cl.EXE"' : return code '0x2'
  105. Stop.
  106. NMAKE : fatal error U1077: '"C:Program Files (x86)Microsoft Visual Studio2017EnterpriseVCToolsMSVC14.16.27023binHostX86x86nmake.exe"' : return code '0x2'
  107. Stop.
  108.  
  109. ==============================
  110. Building regex
  111. ==============================
  112. Microsoft (R) Build Engine version 15.9.21+g9802d43bc3 for .NET Framework
  113. Copyright (C) Microsoft Corporation. All rights reserved.
  114.  
  115. Building the projects in this solution one at a time. To enable parallel build, please add the "/m" switch.
  116. Build started 1/9/2023 17:36:41.
  117. Project "Z:bzflag-dependenciessrcregexregex.sln" on node 1 (default targets).
  118. ValidateSolutionConfiguration:
  119.   Building solution configuration "release|Win32".
  120. Project "Z:bzflag-dependenciessrcregexregex.sln" (1) is building "Z:bzflag-dependenciessrcregexregex.vcxproj" (
  121. 2) on node 1 (default targets).
  122. InitializeBuildStatus:
  123.   Creating "./regex_Win32_Releaseregex.tlogunsuccessfulbuild" because "AlwaysCreate" was specified.
  124. ClCompile:
  125.   All outputs are up-to-date.
  126. Lib:
  127.   All outputs are up-to-date.
  128.   regex.vcxproj -> Z:bzflag-dependenciessrcregex./regex_Win32_Releaseregex.lib
  129. FinalizeBuildStatus:
  130.   Deleting file "./regex_Win32_Releaseregex.tlogunsuccessfulbuild".
  131.   Touching "./regex_Win32_Releaseregex.tlogregex.lastbuildstate".
  132. Done Building Project "Z:bzflag-dependenciessrcregexregex.vcxproj" (default targets).
  133.  
  134. Done Building Project "Z:bzflag-dependenciessrcregexregex.sln" (default targets).
  135.  
  136.  
  137. Build succeeded.
  138.     0 Warning(s)
  139.     0 Error(s)
  140.  
  141. Time Elapsed 00:00:00.96
  142.         1 file(s) copied.
  143.         1 file(s) copied.
  144.         1 file(s) copied.
  145.  
  146. ==============================
  147. Building GLEW
  148. ==============================
  149. Microsoft (R) Build Engine version 15.9.21+g9802d43bc3 for .NET Framework
  150. Copyright (C) Microsoft Corporation. All rights reserved.
  151.  
  152. Building the projects in this solution one at a time. To enable parallel build, please add the "/m" switch.
  153. Build started 1/9/2023 17:36:43.
  154. Project "Z:bzflag-dependenciessrcglewbuildvc12glew.sln" on node 1 (default targets).
  155. ValidateSolutionConfiguration:
  156.   Building solution configuration "release|Win32".
  157. Project "Z:bzflag-dependenciessrcglewbuildvc12glew.sln" (1) is building "Z:bzflag-dependenciessrcglewbuildvc
  158. 12glew_shared.vcxproj" (2) on node 1 (default targets).
  159. InitializeBuildStatus:
  160.   Creating "tmpglew_sharedReleaseWin32glew_shared.tlogunsuccessfulbuild" because "AlwaysCreate" was specified.
  161. ClCompile:
  162.   All outputs are up-to-date.
  163. ResourceCompile:
  164.   All outputs are up-to-date.
  165. Link:
  166.   All outputs are up-to-date.
  167.   glew_shared.vcxproj -> Z:bzflag-dependenciessrcglewbuildvc12....binReleaseWin32glew32.dll
  168. FinalizeBuildStatus:
  169.   Deleting file "tmpglew_sharedReleaseWin32glew_shared.tlogunsuccessfulbuild".
  170.   Touching "tmpglew_sharedReleaseWin32glew_shared.tlogglew_shared.lastbuildstate".
  171. Done Building Project "Z:bzflag-dependenciessrcglewbuildvc12glew_shared.vcxproj" (default targets).
  172.  
  173. Project "Z:bzflag-dependenciessrcglewbuildvc12glew.sln" (1) is building "Z:bzflag-dependenciessrcglewbuildvc
  174. 12glew_static.vcxproj" (3) on node 1 (default targets).
  175. InitializeBuildStatus:
  176.   Creating "tmpglew_staticReleaseWin32glew_static.tlogunsuccessfulbuild" because "AlwaysCreate" was specified.
  177. ClCompile:
  178.   All outputs are up-to-date.
  179. ResourceCompile:
  180.   All outputs are up-to-date.
  181. Lib:
  182.   All outputs are up-to-date.
  183.   glew_static.vcxproj -> Z:bzflag-dependenciessrcglewbuildvc12....libReleaseWin32glew32s.lib
  184. FinalizeBuildStatus:
  185.   Deleting file "tmpglew_staticReleaseWin32glew_static.tlogunsuccessfulbuild".
  186.   Touching "tmpglew_staticReleaseWin32glew_static.tlogglew_static.lastbuildstate".
  187. Done Building Project "Z:bzflag-dependenciessrcglewbuildvc12glew_static.vcxproj" (default targets).
  188.  
  189. Project "Z:bzflag-dependenciessrcglewbuildvc12glew.sln" (1) is building "Z:bzflag-dependenciessrcglewbuildvc
  190. 12glewinfo.vcxproj" (4) on node 1 (default targets).
  191. InitializeBuildStatus:
  192.   Creating "tmpglewinfoReleaseWin32glewinfo.tlogunsuccessfulbuild" because "AlwaysCreate" was specified.
  193. ClCompile:
  194.   All outputs are up-to-date.
  195. ResourceCompile:
  196.   All outputs are up-to-date.
  197. Link:
  198.   All outputs are up-to-date.
  199.   glewinfo.vcxproj -> Z:bzflag-dependenciessrcglewbuildvc12....binReleaseWin32glewinfo.exe
  200. FinalizeBuildStatus:
  201.   Deleting file "tmpglewinfoReleaseWin32glewinfo.tlogunsuccessfulbuild".
  202.   Touching "tmpglewinfoReleaseWin32glewinfo.tlogglewinfo.lastbuildstate".
  203. Done Building Project "Z:bzflag-dependenciessrcglewbuildvc12glewinfo.vcxproj" (default targets).
  204.  
  205. Project "Z:bzflag-dependenciessrcglewbuildvc12glew.sln" (1) is building "Z:bzflag-dependenciessrcglewbuildvc
  206. 12visualinfo.vcxproj" (5) on node 1 (default targets).
  207. InitializeBuildStatus:
  208.   Creating "tmpvisualinfoReleaseWin32visualinfo.tlogunsuccessfulbuild" because "AlwaysCreate" was specified.
  209. ClCompile:
  210.   All outputs are up-to-date.
  211. ResourceCompile:
  212.   All outputs are up-to-date.
  213. Link:
  214.   All outputs are up-to-date.
  215.   visualinfo.vcxproj -> Z:bzflag-dependenciessrcglewbuildvc12....binReleaseWin32visualinfo.exe
  216. FinalizeBuildStatus:
  217.   Deleting file "tmpvisualinfoReleaseWin32visualinfo.tlogunsuccessfulbuild".
  218.   Touching "tmpvisualinfoReleaseWin32visualinfo.tlogvisualinfo.lastbuildstate".
  219. Done Building Project "Z:bzflag-dependenciessrcglewbuildvc12visualinfo.vcxproj" (default targets).
  220.  
  221. Done Building Project "Z:bzflag-dependenciessrcglewbuildvc12glew.sln" (default targets).
  222.  
  223.  
  224. Build succeeded.
  225.     0 Warning(s)
  226.     0 Error(s)
  227.  
  228. Time Elapsed 00:00:09.67
  229. libreleaseWin32glew32.exp
  230.         1 file(s) copied.
  231. libreleaseWin32glew32s.lib
  232.         1 file(s) copied.
  233. binreleaseWin32glew32.pdb
  234. binreleaseWin32glewinfo.pdb
  235. binreleaseWin32visualinfo.pdb
  236.         3 file(s) copied.
  237. includeGLeglew.h
  238. includeGLglew.h
  239. includeGLglxew.h
  240. includeGLwglew.h
  241.         4 file(s) copied.
  242.         1 file(s) copied.
  243.  
  244. ==============================
  245. Building SDL2
  246. ==============================
  247. Microsoft (R) Build Engine version 15.9.21+g9802d43bc3 for .NET Framework
  248. Copyright (C) Microsoft Corporation. All rights reserved.
  249.  
  250. Building the projects in this solution one at a time. To enable parallel build, please add the "/m" switch.
  251. Build started 1/9/2023 17:36:54.
  252. Project "Z:bzflag-dependenciessrcSDL2VisualCSDL.sln" on node 1 (default targets).
  253. ValidateSolutionConfiguration:
  254.   Building solution configuration "release|Win32".
  255. Project "Z:bzflag-dependenciessrcSDL2VisualCSDL.sln" (1) is building "Z:bzflag-dependenciessrcSDL2VisualCSDL
  256. SDL.vcxproj" (2) on node 1 (default targets).
  257. InitializeBuildStatus:
  258.   Touching "Win32ReleaseSDL2.tlogunsuccessfulbuild".
  259. ClCompile:
  260.   All outputs are up-to-date.
  261. ResourceCompile:
  262.   All outputs are up-to-date.
  263. Link:
  264.   C:Program Files (x86)Microsoft Visual Studio2017EnterpriseVCToolsMSVC14.16.27023binHostX86x86link.exe /ER
  265.   RORREPORT:QUEUE /OUT:"Z:bzflag-dependenciessrcSDL2VisualCWin32ReleaseSDL2.dll" /NOLOGO setupapi.lib winmm.lib
  266.   imm32.lib version.lib kernel32.lib user32.lib gdi32.lib winspool.lib comdlg32.lib advapi32.lib shell32.lib ole32.lib
  267.   oleaut32.lib uuid.lib odbc32.lib odbccp32.lib /NODEFAULTLIB /MANIFEST /MANIFESTUAC:"level='asInvoker' uiAccess='false
  268.   '" /manifest:embed /DEBUG /PDB:"Z:bzflag-dependenciessrcSDL2VisualCWin32ReleaseSDL2.pdb" /SUBSYSTEM:WINDOWS /O
  269.   PT:REF /OPT:ICF /TLBID:1 /DYNAMICBASE /NXCOMPAT /IMPLIB:"Z:bzflag-dependenciessrcSDL2VisualCWin32ReleaseSDL2.l
  270.   ib" /MACHINE:X86 /SAFESEH /DLL Win32Releaseversion.res
  271.   Win32ReleaseSDL_guid.obj
  272.   Win32ReleaseSDL_atomic.obj
  273.   Win32ReleaseSDL_spinlock.obj
  274.   Win32ReleaseSDL_directsound.obj
  275.   Win32ReleaseSDL_diskaudio.obj
  276.   Win32ReleaseSDL_dummyaudio.obj
  277.   Win32ReleaseSDL_audio.obj
  278.   Win32ReleaseSDL_audiocvt.obj
  279.   Win32ReleaseSDL_audiodev.obj
  280.   Win32ReleaseSDL_audiotypecvt.obj
  281.   Win32ReleaseSDL_mixer.obj
  282.   Win32ReleaseSDL_wave.obj
  283.   Win32ReleaseSDL_winmm.obj
  284.   Win32ReleaseSDL_wasapi.obj
  285.   Win32ReleaseSDL_wasapi_win32.obj
  286.   Win32ReleaseSDL_hid.obj
  287.   Win32ReleaseSDL_immdevice.obj
  288.   Win32ReleaseSDL_windows.obj
  289.   Win32ReleaseSDL_xinput.obj
  290.   Win32ReleaseSDL_cpuinfo.obj
  291.   Win32ReleaseSDL_dynapi.obj
  292.   Win32ReleaseSDL_clipboardevents.obj
  293.   Win32ReleaseSDL_displayevents.obj
  294.   Win32ReleaseSDL_dropevents.obj
  295.   Win32ReleaseSDL_events.obj
  296.   Win32ReleaseSDL_gesture.obj
  297.   Win32ReleaseSDL_keyboard.obj
  298.   Win32ReleaseSDL_mouse.obj
  299.   Win32ReleaseSDL_quit.obj
  300.   Win32ReleaseSDL_touch.obj
  301.   Win32ReleaseSDL_windowevents.obj
  302.   Win32ReleaseSDL_rwops.obj
  303.   Win32ReleaseSDL_sysfilesystem.obj
  304.   Win32ReleaseSDL_syshaptic.obj
  305.   Win32ReleaseSDL_haptic.obj
  306.   Win32ReleaseSDL_dinputhaptic.obj
  307.   Win32ReleaseSDL_windowshaptic.obj
  308.   Win32ReleaseSDL_xinputhaptic.obj
  309.   Win32ReleaseSDL_hidapi.obj
  310.   Win32Releasecontroller_type.obj
  311.   Win32ReleaseSDL_sysjoystick.obj
  312.   Win32ReleaseSDL_hidapijoystick.obj
  313.   Win32ReleaseSDL_hidapi_combined.obj
  314.   Win32ReleaseSDL_hidapi_gamecube.obj
  315.   Win32ReleaseSDL_hidapi_luna.obj
  316.   Win32ReleaseSDL_hidapi_ps3.obj
  317.   Win32ReleaseSDL_hidapi_ps4.obj
  318.   Win32ReleaseSDL_hidapi_ps5.obj
  319.   Win32ReleaseSDL_hidapi_rumble.obj
  320.   Win32ReleaseSDL_hidapi_shield.obj
  321.   Win32ReleaseSDL_hidapi_stadia.obj
  322.   Win32ReleaseSDL_hidapi_steam.obj
  323.   Win32ReleaseSDL_hidapi_switch.obj
  324.   Win32ReleaseSDL_hidapi_wii.obj
  325.   Win32ReleaseSDL_hidapi_xbox360.obj
  326.   Win32ReleaseSDL_hidapi_xbox360w.obj
  327.   Win32ReleaseSDL_hidapi_xboxone.obj
  328.   Win32ReleaseSDL_gamecontroller.obj
  329.   Win32ReleaseSDL_joystick.obj
  330.   Win32ReleaseSDL_virtualjoystick.obj
  331.   Win32ReleaseSDL_dinputjoystick.obj
  332.   Win32ReleaseSDL_rawinputjoystick.obj
  333.   Win32ReleaseSDL_windowsjoystick.obj
  334.   Win32ReleaseSDL_windows_gaming_input.obj
  335.   Win32ReleaseSDL_xinputjoystick.obj
  336.   Win32Releasee_atan2.obj
  337.   Win32Releasee_exp.obj
  338.   Win32Releasee_fmod.obj
  339.   Win32Releasee_log.obj
  340.   Win32Releasee_log10.obj
  341.   Win32Releasee_pow.obj
  342.   Win32Releasee_rem_pio2.obj
  343.   Win32Releasee_sqrt.obj
  344.   Win32Releasek_cos.obj
  345.   Win32Releasek_rem_pio2.obj
  346.   Win32Releasek_sin.obj
  347.   Win32Releasek_tan.obj
  348.   Win32Releases_atan.obj
  349.   Win32Releases_copysign.obj
  350.   Win32Releases_cos.obj
  351.   Win32Releases_fabs.obj
  352.   Win32Releases_floor.obj
  353.   Win32Releases_scalbn.obj
  354.   Win32Releases_sin.obj
  355.   Win32Releases_tan.obj
  356.   Win32ReleaseSDL_sysloadso.obj
  357.   Win32ReleaseSDL_locale.obj
  358.   Win32ReleaseSDL_syslocale.obj
  359.   Win32ReleaseSDL_url.obj
  360.   Win32ReleaseSDL_sysurl.obj
  361.   Win32ReleaseSDL_power.obj
  362.   Win32ReleaseSDL_syspower.obj
  363.   Win32ReleaseSDL_shaders_d3d11.obj
  364.   Win32ReleaseSDL_render_d3d12.obj
  365.   Win32ReleaseSDL_shaders_d3d12.obj
  366.   Win32ReleaseSDL_render_d3d.obj
  367.   Win32ReleaseSDL_render_d3d11.obj
  368.   Win32ReleaseSDL_shaders_d3d.obj
  369.   Win32ReleaseSDL_render_gl.obj
  370.   Win32ReleaseSDL_shaders_gl.obj
  371.   Win32ReleaseSDL_render_gles2.obj
  372.   Win32ReleaseSDL_shaders_gles2.obj
  373.   Win32ReleaseSDL_d3dmath.obj
  374.   Win32ReleaseSDL_render.obj
  375.   Win32ReleaseSDL_yuv_sw.obj
  376.   Win32ReleaseSDL_blendfillrect.obj
  377.   Win32ReleaseSDL_blendline.obj
  378.   Win32ReleaseSDL_blendpoint.obj
  379.   Win32ReleaseSDL_drawline.obj
  380.   Win32ReleaseSDL_drawpoint.obj
  381.   Win32ReleaseSDL_render_sw.obj
  382.   Win32ReleaseSDL_rotate.obj
  383.   Win32ReleaseSDL_triangle.obj
  384.   Win32ReleaseSDL.obj
  385.   Win32ReleaseSDL_assert.obj
  386.   Win32ReleaseSDL_dataqueue.obj
  387.   Win32ReleaseSDL_list.obj
  388.   Win32ReleaseSDL_error.obj
  389.   Win32ReleaseSDL_hints.obj
  390.   Win32ReleaseSDL_log.obj
  391.   Win32ReleaseSDL_utils.obj
  392.   Win32ReleaseSDL_dummysensor.obj
  393.   Win32ReleaseSDL_sensor.obj
  394.   Win32ReleaseSDL_windowssensor.obj
  395.   Win32ReleaseSDL_crc16.obj
  396.   Win32ReleaseSDL_crc32.obj
  397.   Win32ReleaseSDL_getenv.obj
  398.   Win32ReleaseSDL_iconv.obj
  399.   Win32ReleaseSDL_malloc.obj
  400.   Win32ReleaseSDL_mslibc.obj
  401.   Win32ReleaseSDL_qsort.obj
  402.   Win32ReleaseSDL_stdlib.obj
  403.   Win32ReleaseSDL_string.obj
  404.   Win32ReleaseSDL_strtokr.obj
  405.   Win32ReleaseSDL_syscond.obj
  406.   Win32ReleaseSDL_thread.obj
  407.   Win32ReleaseSDL_syscond_cv.obj
  408.   Win32ReleaseSDL_sysmutex.obj
  409.   Win32ReleaseSDL_syssem.obj
  410.   Win32ReleaseSDL_systhread.obj
  411.   Win32ReleaseSDL_systls.obj
  412.   Win32ReleaseSDL_timer.obj
  413.   Win32ReleaseSDL_systimer.obj
  414.   Win32ReleaseSDL_nullevents.obj
  415.   Win32ReleaseSDL_nullframebuffer.obj
  416.   Win32ReleaseSDL_nullvideo.obj
  417.   Win32ReleaseSDL_blit.obj
  418.   Win32ReleaseSDL_blit_0.obj
  419.   Win32ReleaseSDL_blit_1.obj
  420.   Win32ReleaseSDL_blit_A.obj
  421.   Win32ReleaseSDL_blit_auto.obj
  422.   Win32ReleaseSDL_blit_copy.obj
  423.   Win32ReleaseSDL_blit_N.obj
  424.   Win32ReleaseSDL_blit_slow.obj
  425.   Win32ReleaseSDL_bmp.obj
  426.   Win32ReleaseSDL_clipboard.obj
  427.   Win32ReleaseSDL_egl.obj
  428.   Win32ReleaseSDL_fillrect.obj
  429.   Win32ReleaseSDL_pixels.obj
  430.   Win32ReleaseSDL_rect.obj
  431.   Win32ReleaseSDL_RLEaccel.obj
  432.   Win32ReleaseSDL_shape.obj
  433.   Win32ReleaseSDL_stretch.obj
  434.   Win32ReleaseSDL_surface.obj
  435.   Win32ReleaseSDL_video.obj
  436.   Win32ReleaseSDL_vulkan_utils.obj
  437.   Win32ReleaseSDL_yuv.obj
  438.   Win32ReleaseSDL_windowsclipboard.obj
  439.   Win32ReleaseSDL_windowsevents.obj
  440.   Win32ReleaseSDL_windowsframebuffer.obj
  441.   Win32ReleaseSDL_windowskeyboard.obj
  442.   Win32ReleaseSDL_windowsmessagebox.obj
  443.   Win32ReleaseSDL_windowsmodes.obj
  444.   Win32ReleaseSDL_windowsmouse.obj
  445.   Win32ReleaseSDL_windowsopengl.obj
  446.   Win32ReleaseSDL_windowsopengles.obj
  447.   Win32ReleaseSDL_windowsshape.obj
  448.   Win32ReleaseSDL_windowsvideo.obj
  449.   Win32ReleaseSDL_windowsvulkan.obj
  450.   Win32ReleaseSDL_windowswindow.obj
  451.   Win32Releaseyuv_rgb.obj
  452.      Creating library Z:bzflag-dependenciessrcSDL2VisualCWin32ReleaseSDL2.lib and object Z:bzflag-dependencies
  453.   srcSDL2VisualCWin32ReleaseSDL2.exp
  454.   SDL.vcxproj -> Z:bzflag-dependenciessrcSDL2VisualCWin32ReleaseSDL2.dll
  455. FinalizeBuildStatus:
  456.   Deleting file "Win32ReleaseSDL2.tlogunsuccessfulbuild".
  457.   Touching "Win32ReleaseSDL2.tlogSDL2.lastbuildstate".
  458. Done Building Project "Z:bzflag-dependenciessrcSDL2VisualCSDLSDL.vcxproj" (default targets).
  459.  
  460. Project "Z:bzflag-dependenciessrcSDL2VisualCSDL.sln" (1) is building "Z:bzflag-dependenciessrcSDL2VisualCSDLm
  461. ainSDLmain.vcxproj" (3) on node 1 (default targets).
  462. InitializeBuildStatus:
  463.   Creating "Win32ReleaseSDL2main.tlogunsuccessfulbuild" because "AlwaysCreate" was specified.
  464. ClCompile:
  465.   All outputs are up-to-date.
  466. Lib:
  467.   All outputs are up-to-date.
  468.   SDLmain.vcxproj -> Z:bzflag-dependenciessrcSDL2VisualCWin32ReleaseSDL2main.lib
  469. FinalizeBuildStatus:
  470.   Deleting file "Win32ReleaseSDL2main.tlogunsuccessfulbuild".
  471.   Touching "Win32ReleaseSDL2main.tlogSDL2main.lastbuildstate".
  472. Done Building Project "Z:bzflag-dependenciessrcSDL2VisualCSDLmainSDLmain.vcxproj" (default targets).
  473.  
  474. Project "Z:bzflag-dependenciessrcSDL2VisualCSDL.sln" (1) is building "Z:bzflag-dependenciessrcSDL2VisualCtest
  475. scheckkeyscheckkeys.vcxproj" (4) on node 1 (default targets).
  476. Project "Z:bzflag-dependenciessrcSDL2VisualCtestscheckkeyscheckkeys.vcxproj" (4) is building "Z:bzflag-dependen
  477. ciessrcSDL2VisualCSDLtestSDLtest.vcxproj" (5) on node 1 (default targets).
  478. InitializeBuildStatus:
  479.   Creating "Win32ReleaseSDL2test.tlogunsuccessfulbuild" because "AlwaysCreate" was specified.
  480. ClCompile:
  481.   All outputs are up-to-date.
  482. Lib:
  483.   All outputs are up-to-date.
  484.   SDLtest.vcxproj -> Z:bzflag-dependenciessrcSDL2VisualCWin32ReleaseSDL2test.lib
  485. FinalizeBuildStatus:
  486.   Deleting file "Win32ReleaseSDL2test.tlogunsuccessfulbuild".
  487.   Touching "Win32ReleaseSDL2test.tlogSDL2test.lastbuildstate".
  488. Done Building Project "Z:bzflag-dependenciessrcSDL2VisualCSDLtestSDLtest.vcxproj" (default targets).
  489.  
  490. PrepareForBuild:
  491.   Creating directory "Win32Releasecheckkeys.tlog".
  492. InitializeBuildStatus:
  493.   Creating "Win32Releasecheckkeys.tlogunsuccessfulbuild" because "AlwaysCreate" was specified.
  494. ClCompile:
  495.   C:Program Files (x86)Microsoft Visual Studio2017EnterpriseVCToolsMSVC14.16.27023binHostX86x86CL.exe /c /I
  496.   "Z:bzflag-dependenciessrcSDL2VisualCWin32Release" /I"Z:bzflag-dependenciessrcSDL2VisualC/../include" /AIWi
  497.   n32Release /Zi /nologo /W3 /WX- /diagnostics:classic /O2 /Oy- /D WIN32 /D NDEBUG /D _WINDOWS /D _VC80_UPGRADE=0x070
  498.   0 /Gm- /EHsc /MD /GS /fp:precise /Qspectre /Zc:wchar_t /Zc:forScope /Zc:inline /Fo"Win32Release" /Fd"Win32Release
  499.   vc141.pdb" /Gd /TC /analyze- /FC /errorReport:queue ......testcheckkeys.c
  500.   checkkeys.c
  501. Link:
  502.   C:Program Files (x86)Microsoft Visual Studio2017EnterpriseVCToolsMSVC14.16.27023binHostX86x86link.exe /ER
  503.   RORREPORT:QUEUE /OUT:"Z:bzflag-dependenciessrcSDL2VisualCWin32Releasecheckkeys.exe" /NOLOGO kernel32.lib user3
  504.   2.lib gdi32.lib winspool.lib comdlg32.lib advapi32.lib shell32.lib ole32.lib oleaut32.lib uuid.lib odbc32.lib odbccp3
  505.   2.lib /MANIFEST /MANIFESTUAC:"level='asInvoker' uiAccess='false'" /manifest:embed /DEBUG:FULL /PDB:"Z:bzflag-depende
  506.   nciessrcSDL2VisualCWin32Releasecheckkeys.pdb" /SUBSYSTEM:WINDOWS /TLBID:1 /DYNAMICBASE /NXCOMPAT /IMPLIB:"Z:bz
  507.   flag-dependenciessrcSDL2VisualCWin32Releasecheckkeys.lib" /MACHINE:X86 /SAFESEH Win32Releasecheckkeys.obj
  508.   "Z:bzflag-dependenciessrcSDL2VisualCWin32ReleaseSDL2.lib"
  509.   "Z:bzflag-dependenciessrcSDL2VisualCWin32ReleaseSDL2main.lib"
  510.   "Z:bzflag-dependenciessrcSDL2VisualCWin32ReleaseSDL2test.lib"
  511.   checkkeys.vcxproj -> Z:bzflag-dependenciessrcSDL2VisualCWin32Releasecheckkeys.exe
  512. FinalizeBuildStatus:
  513.   Deleting file "Win32Releasecheckkeys.tlogunsuccessfulbuild".
  514.   Touching "Win32Releasecheckkeys.tlogcheckkeys.lastbuildstate".
  515. Done Building Project "Z:bzflag-dependenciessrcSDL2VisualCtestscheckkeyscheckkeys.vcxproj" (default targets).
  516.  
  517. Project "Z:bzflag-dependenciessrcSDL2VisualCSDL.sln" (1) is building "Z:bzflag-dependenciessrcSDL2VisualCtest
  518. sloopwaveloopwave.vcxproj" (6) on node 1 (default targets).
  519. PrepareForBuild:
  520.   Creating directory "Win32Releaseloopwave.tlog".
  521. InitializeBuildStatus:
  522.   Creating "Win32Releaseloopwave.tlogunsuccessfulbuild" because "AlwaysCreate" was specified.
  523. CustomBuild:
  524.   Copying sample.wav
  525.           1 file(s) copied.
  526. ClCompile:
  527.   C:Program Files (x86)Microsoft Visual Studio2017EnterpriseVCToolsMSVC14.16.27023binHostX86x86CL.exe /c /I
  528.   "Z:bzflag-dependenciessrcSDL2VisualC/../include" /Zi /nologo /W3 /WX- /diagnostics:classic /O2 /Oy- /D WIN32 /D
  529.   NDEBUG /D _WINDOWS /D _VC80_UPGRADE=0x0700 /Gm- /EHsc /MD /GS /fp:precise /Qspectre /Zc:wchar_t /Zc:forScope /Zc:inli
  530.   ne /Fo"Win32Release" /Fd"Win32Releasevc141.pdb" /Gd /TC /analyze- /FC /errorReport:queue ......Testloopwave.
  531.   c ......testtestutils.c
  532.   loopwave.c
  533.   testutils.c
  534.   Generating Code...
  535. Link:
  536.   C:Program Files (x86)Microsoft Visual Studio2017EnterpriseVCToolsMSVC14.16.27023binHostX86x86link.exe /ER
  537.   RORREPORT:QUEUE /OUT:"Z:bzflag-dependenciessrcSDL2VisualCWin32Releaseloopwave.exe" /NOLOGO kernel32.lib user32
  538.   .lib gdi32.lib winspool.lib comdlg32.lib advapi32.lib shell32.lib ole32.lib oleaut32.lib uuid.lib odbc32.lib odbccp32
  539.   .lib /MANIFEST /MANIFESTUAC:"level='asInvoker' uiAccess='false'" /manifest:embed /DEBUG:FULL /PDB:"Z:bzflag-dependen
  540.   ciessrcSDL2VisualCWin32Releaseloopwave.pdb" /SUBSYSTEM:WINDOWS /TLBID:1 /DYNAMICBASE /NXCOMPAT /IMPLIB:"Z:bzfl
  541.   ag-dependenciessrcSDL2VisualCWin32Releaseloopwave.lib" /MACHINE:X86 /SAFESEH Win32Releaseloopwave.obj
  542.   Win32Releasetestutils.obj
  543.   "Z:bzflag-dependenciessrcSDL2VisualCWin32ReleaseSDL2.lib"
  544.   "Z:bzflag-dependenciessrcSDL2VisualCWin32ReleaseSDL2main.lib"
  545.   loopwave.vcxproj -> Z:bzflag-dependenciessrcSDL2VisualCWin32Releaseloopwave.exe
  546. FinalizeBuildStatus:
  547.   Deleting file "Win32Releaseloopwave.tlogunsuccessfulbuild".
  548.   Touching "Win32Releaseloopwave.tlogloopwave.lastbuildstate".
  549. Done Building Project "Z:bzflag-dependenciessrcSDL2VisualCtestsloopwaveloopwave.vcxproj" (default targets).
  550.  
  551. Project "Z:bzflag-dependenciessrcSDL2VisualCSDL.sln" (1) is building "Z:bzflag-dependenciessrcSDL2VisualCtest
  552. stestatomictestatomic.vcxproj" (7) on node 1 (default targets).
  553. PrepareForBuild:
  554.   Creating directory "Win32Releasetestatomic.tlog".
  555. InitializeBuildStatus:
  556.   Creating "Win32Releasetestatomic.tlogunsuccessfulbuild" because "AlwaysCreate" was specified.
  557. ClCompile:
  558.   C:Program Files (x86)Microsoft Visual Studio2017EnterpriseVCToolsMSVC14.16.27023binHostX86x86CL.exe /c /I
  559.   "Z:bzflag-dependenciessrcSDL2VisualC/../include" /Zi /nologo /W3 /WX- /diagnostics:classic /O2 /Oy- /D WIN32 /D
  560.   NDEBUG /D _WINDOWS /D _VC80_UPGRADE=0x0700 /Gm- /EHsc /MD /GS /fp:precise /Qspectre /Zc:wchar_t /Zc:forScope /Zc:inli
  561.   ne /Fo"Win32Release" /Fd"Win32Releasevc141.pdb" /Gd /TC /analyze- /FC /errorReport:queue ......testtestatomi
  562.   c.c
  563.   testatomic.c
  564. Link:
  565.   C:Program Files (x86)Microsoft Visual Studio2017EnterpriseVCToolsMSVC14.16.27023binHostX86x86link.exe /ER
  566.   RORREPORT:QUEUE /OUT:"Z:bzflag-dependenciessrcSDL2VisualCWin32Releasetestatomic.exe" /NOLOGO kernel32.lib user
  567.   32.lib gdi32.lib winspool.lib comdlg32.lib advapi32.lib shell32.lib ole32.lib oleaut32.lib uuid.lib odbc32.lib odbccp
  568.   32.lib /MANIFEST /MANIFESTUAC:"level='asInvoker' uiAccess='false'" /manifest:embed /DEBUG:FULL /PDB:"Z:bzflag-depend
  569.   enciessrcSDL2VisualCWin32Releasetestatomic.pdb" /SUBSYSTEM:WINDOWS /TLBID:1 /DYNAMICBASE /NXCOMPAT /IMPLIB:"Z:
  570.   bzflag-dependenciessrcSDL2VisualCWin32Releasetestatomic.lib" /MACHINE:X86 /SAFESEH Win32Releasetestatomic.obj
  571.   "Z:bzflag-dependenciessrcSDL2VisualCWin32ReleaseSDL2.lib"
  572.   "Z:bzflag-dependenciessrcSDL2VisualCWin32ReleaseSDL2main.lib"
  573.   testatomic.vcxproj -> Z:bzflag-dependenciessrcSDL2VisualCWin32Releasetestatomic.exe
  574. FinalizeBuildStatus:
  575.   Deleting file "Win32Releasetestatomic.tlogunsuccessfulbuild".
  576.   Touching "Win32Releasetestatomic.tlogtestatomic.lastbuildstate".
  577. Done Building Project "Z:bzflag-dependenciessrcSDL2VisualCteststestatomictestatomic.vcxproj" (default targets).
  578.  
  579. Project "Z:bzflag-dependenciessrcSDL2VisualCSDL.sln" (1) is building "Z:bzflag-dependenciessrcSDL2VisualCtest
  580. stestautomationtestautomation.vcxproj" (8) on node 1 (default targets).
  581. PrepareForBuild:
  582.   Creating directory "Win32Releasetestautomation.tlog".
  583. InitializeBuildStatus:
  584.   Creating "Win32Releasetestautomation.tlogunsuccessfulbuild" because "AlwaysCreate" was specified.
  585. ClCompile:
  586.   C:Program Files (x86)Microsoft Visual Studio2017EnterpriseVCToolsMSVC14.16.27023binHostX86x86CL.exe /c /I
  587.   "Z:bzflag-dependenciessrcSDL2VisualC/../include" /Zi /nologo /W3 /WX- /diagnostics:classic /O2 /Oy- /D WIN32 /D
  588.   NDEBUG /D _WINDOWS /D _VC80_UPGRADE=0x0700 /Gm- /EHsc /MD /GS /fp:precise /Qspectre /Zc:wchar_t /Zc:forScope /Zc:inli
  589.   ne /Fo"Win32Release" /Fd"Win32Releasevc141.pdb" /Gd /TC /analyze- /FC /errorReport:queue ......Testtestautom
  590.   ation.c ......testtestautomation_audio.c ......testtestautomation_clipboard.c ......testtestautomation_ev
  591.   ents.c ......testtestautomation_guid.c ......testtestautomation_hints.c ......testtestautomation_joystick
  592.   .c ......testtestautomation_keyboard.c ......testtestautomation_main.c ......testtestautomation_math.c ..
  593.   ....testtestautomation_mouse.c ......testtestautomation_pixels.c ......testtestautomation_platform.c ...
  594.   ...testtestautomation_rect.c ......testtestautomation_render.c ......testtestautomation_rwops.c ......t
  595.   esttestautomation_sdltest.c ......testtestautomation_stdlib.c ......testtestautomation_surface.c ......te
  596.   sttestautomation_syswm.c ......testtestautomation_timer.c ......testtestautomation_video.c
  597.   testautomation.c
  598.   testautomation_audio.c
  599.   testautomation_clipboard.c
  600.   testautomation_events.c
  601.   testautomation_guid.c
  602.   testautomation_hints.c
  603.   testautomation_joystick.c
  604.   testautomation_keyboard.c
  605.   testautomation_main.c
  606.   testautomation_math.c
  607.   testautomation_mouse.c
  608.   testautomation_pixels.c
  609.   testautomation_platform.c
  610.   testautomation_rect.c
  611.   testautomation_render.c
  612.   testautomation_rwops.c
  613.   testautomation_sdltest.c
  614.   testautomation_stdlib.c
  615.   testautomation_surface.c
  616.   testautomation_syswm.c
  617.   Generating Code...
  618.   Compiling...
  619.   testautomation_timer.c
  620.   testautomation_video.c
  621.   Generating Code...
  622. Link:
  623.   C:Program Files (x86)Microsoft Visual Studio2017EnterpriseVCToolsMSVC14.16.27023binHostX86x86link.exe /ER
  624.   RORREPORT:QUEUE /OUT:"Z:bzflag-dependenciessrcSDL2VisualCWin32Releasetestautomation.exe" /NOLOGO kernel32.lib
  625.   user32.lib gdi32.lib winspool.lib comdlg32.lib advapi32.lib shell32.lib ole32.lib oleaut32.lib uuid.lib odbc32.lib od
  626.   bccp32.lib /MANIFEST /MANIFESTUAC:"level='asInvoker' uiAccess='false'" /manifest:embed /DEBUG:FULL /PDB:"Z:bzflag-de
  627.   pendenciessrcSDL2VisualCWin32Releasetestautomation.pdb" /SUBSYSTEM:WINDOWS /TLBID:1 /DYNAMICBASE /NXCOMPAT /IMP
  628.   LIB:"Z:bzflag-dependenciessrcSDL2VisualCWin32Releasetestautomation.lib" /MACHINE:X86 /SAFESEH Win32Releasete
  629.   stautomation.obj
  630.   Win32Releasetestautomation_audio.obj
  631.   Win32Releasetestautomation_clipboard.obj
  632.   Win32Releasetestautomation_events.obj
  633.   Win32Releasetestautomation_guid.obj
  634.   Win32Releasetestautomation_hints.obj
  635.   Win32Releasetestautomation_joystick.obj
  636.   Win32Releasetestautomation_keyboard.obj
  637.   Win32Releasetestautomation_main.obj
  638.   Win32Releasetestautomation_math.obj
  639.   Win32Releasetestautomation_mouse.obj
  640.   Win32Releasetestautomation_pixels.obj
  641.   Win32Releasetestautomation_platform.obj
  642.   Win32Releasetestautomation_rect.obj
  643.   Win32Releasetestautomation_render.obj
  644.   Win32Releasetestautomation_rwops.obj
  645.   Win32Releasetestautomation_sdltest.obj
  646.   Win32Releasetestautomation_stdlib.obj
  647.   Win32Releasetestautomation_surface.obj
  648.   Win32Releasetestautomation_syswm.obj
  649.   Win32Releasetestautomation_timer.obj
  650.   Win32Releasetestautomation_video.obj
  651.   "Z:bzflag-dependenciessrcSDL2VisualCWin32ReleaseSDL2.lib"
  652.   "Z:bzflag-dependenciessrcSDL2VisualCWin32ReleaseSDL2main.lib"
  653.   "Z:bzflag-dependenciessrcSDL2VisualCWin32ReleaseSDL2test.lib"
  654.   testautomation.vcxproj -> Z:bzflag-dependenciessrcSDL2VisualCWin32Releasetestautomation.exe
  655. FinalizeBuildStatus:
  656.   Deleting file "Win32Releasetestautomation.tlogunsuccessfulbuild".
  657.   Touching "Win32Releasetestautomation.tlogtestautomation.lastbuildstate".
  658. Done Building Project "Z:bzflag-dependenciessrcSDL2VisualCteststestautomationtestautomation.vcxproj" (default ta
  659. rgets).
  660.  
  661. Project "Z:bzflag-dependenciessrcSDL2VisualCSDL.sln" (1) is building "Z:bzflag-dependenciessrcSDL2VisualCtest
  662. stestdraw2testdraw2.vcxproj" (9) on node 1 (default targets).
  663. PrepareForBuild:
  664.   Creating directory "Win32Releasetestdraw2.tlog".
  665. InitializeBuildStatus:
  666.   Creating "Win32Releasetestdraw2.tlogunsuccessfulbuild" because "AlwaysCreate" was specified.
  667. ClCompile:
  668.   C:Program Files (x86)Microsoft Visual Studio2017EnterpriseVCToolsMSVC14.16.27023binHostX86x86CL.exe /c /I
  669.   "Z:bzflag-dependenciessrcSDL2VisualC/../include" /Zi /nologo /W3 /WX- /diagnostics:classic /O2 /Oy- /D WIN32 /D
  670.   NDEBUG /D _WINDOWS /D _VC80_UPGRADE=0x0700 /Gm- /EHsc /MD /GS /fp:precise /Qspectre /Zc:wchar_t /Zc:forScope /Zc:inli
  671.   ne /Fo"Win32Release" /Fd"Win32Releasevc141.pdb" /Gd /TC /analyze- /FC /errorReport:queue ......testtestdraw2
  672.   .c
  673.   testdraw2.c
  674. Link:
  675.   C:Program Files (x86)Microsoft Visual Studio2017EnterpriseVCToolsMSVC14.16.27023binHostX86x86link.exe /ER
  676.   RORREPORT:QUEUE /OUT:"Z:bzflag-dependenciessrcSDL2VisualCWin32Releasetestdraw2.exe" /NOLOGO kernel32.lib user3
  677.   2.lib gdi32.lib winspool.lib comdlg32.lib advapi32.lib shell32.lib ole32.lib oleaut32.lib uuid.lib odbc32.lib odbccp3
  678.   2.lib /MANIFEST /MANIFESTUAC:"level='asInvoker' uiAccess='false'" /manifest:embed /DEBUG:FULL /PDB:"Z:bzflag-depende
  679.   nciessrcSDL2VisualCWin32Releasetestdraw2.pdb" /SUBSYSTEM:WINDOWS /TLBID:1 /DYNAMICBASE /NXCOMPAT /IMPLIB:"Z:bz
  680.   flag-dependenciessrcSDL2VisualCWin32Releasetestdraw2.lib" /MACHINE:X86 /SAFESEH Win32Releasetestdraw2.obj
  681.   "Z:bzflag-dependenciessrcSDL2VisualCWin32ReleaseSDL2.lib"
  682.   "Z:bzflag-dependenciessrcSDL2VisualCWin32ReleaseSDL2main.lib"
  683.   "Z:bzflag-dependenciessrcSDL2VisualCWin32ReleaseSDL2test.lib"
  684.   testdraw2.vcxproj -> Z:bzflag-dependenciessrcSDL2VisualCWin32Releasetestdraw2.exe
  685. FinalizeBuildStatus:
  686.   Deleting file "Win32Releasetestdraw2.tlogunsuccessfulbuild".
  687.   Touching "Win32Releasetestdraw2.tlogtestdraw2.lastbuildstate".
  688. Done Building Project "Z:bzflag-dependenciessrcSDL2VisualCteststestdraw2testdraw2.vcxproj" (default targets).
  689.  
  690. Project "Z:bzflag-dependenciessrcSDL2VisualCSDL.sln" (1) is building "Z:bzflag-dependenciessrcSDL2VisualCtest
  691. stestfiletestfile.vcxproj" (10) on node 1 (default targets).
  692. PrepareForBuild:
  693.   Creating directory "Win32Releasetestfile.tlog".
  694. InitializeBuildStatus:
  695.   Creating "Win32Releasetestfile.tlogunsuccessfulbuild" because "AlwaysCreate" was specified.
  696. ClCompile:
  697.   C:Program Files (x86)Microsoft Visual Studio2017EnterpriseVCToolsMSVC14.16.27023binHostX86x86CL.exe /c /I
  698.   "Z:bzflag-dependenciessrcSDL2VisualC/../include" /Zi /nologo /W3 /WX- /diagnostics:classic /O2 /Oy- /D WIN32 /D
  699.   NDEBUG /D _WINDOWS /D _VC80_UPGRADE=0x0700 /Gm- /EHsc /MD /GS /fp:precise /Qspectre /Zc:wchar_t /Zc:forScope /Zc:inli
  700.   ne /Fo"Win32Release" /Fd"Win32Releasevc141.pdb" /Gd /TC /analyze- /FC /errorReport:queue ......Testtestfile.
  701.   c
  702.   testfile.c
  703. Link:
  704.   C:Program Files (x86)Microsoft Visual Studio2017EnterpriseVCToolsMSVC14.16.27023binHostX86x86link.exe /ER
  705.   RORREPORT:QUEUE /OUT:"Z:bzflag-dependenciessrcSDL2VisualCWin32Releasetestfile.exe" /NOLOGO kernel32.lib user32
  706.   .lib gdi32.lib winspool.lib comdlg32.lib advapi32.lib shell32.lib ole32.lib oleaut32.lib uuid.lib odbc32.lib odbccp32
  707.   .lib /MANIFEST /MANIFESTUAC:"level='asInvoker' uiAccess='false'" /manifest:embed /DEBUG:FULL /PDB:"Z:bzflag-dependen
  708.   ciessrcSDL2VisualCWin32Releasetestfile.pdb" /SUBSYSTEM:WINDOWS /TLBID:1 /DYNAMICBASE /NXCOMPAT /IMPLIB:"Z:bzfl
  709.   ag-dependenciessrcSDL2VisualCWin32Releasetestfile.lib" /MACHINE:X86 /SAFESEH Win32Releasetestfile.obj
  710.   "Z:bzflag-dependenciessrcSDL2VisualCWin32ReleaseSDL2.lib"
  711.   "Z:bzflag-dependenciessrcSDL2VisualCWin32ReleaseSDL2main.lib"
  712.   testfile.vcxproj -> Z:bzflag-dependenciessrcSDL2VisualCWin32Releasetestfile.exe
  713. FinalizeBuildStatus:
  714.   Deleting file "Win32Releasetestfile.tlogunsuccessfulbuild".
  715.   Touching "Win32Releasetestfile.tlogtestfile.lastbuildstate".
  716. Done Building Project "Z:bzflag-dependenciessrcSDL2VisualCteststestfiletestfile.vcxproj" (default targets).
  717.  
  718. Project "Z:bzflag-dependenciessrcSDL2VisualCSDL.sln" (1) is building "Z:bzflag-dependenciessrcSDL2VisualCtest
  719. stestgesturetestgesture.vcxproj" (11) on node 1 (default targets).
  720. PrepareForBuild:
  721.   Creating directory "Win32Releasetestgesture.tlog".
  722. InitializeBuildStatus:
  723.   Creating "Win32Releasetestgesture.tlogunsuccessfulbuild" because "AlwaysCreate" was specified.
  724. ClCompile:
  725.   C:Program Files (x86)Microsoft Visual Studio2017EnterpriseVCToolsMSVC14.16.27023binHostX86x86CL.exe /c /I
  726.   "Z:bzflag-dependenciessrcSDL2VisualC/../include" /Zi /nologo /W3 /WX- /diagnostics:classic /O2 /Oy- /D WIN32 /D
  727.   NDEBUG /D _WINDOWS /D _VC80_UPGRADE=0x0700 /Gm- /EHsc /MD /GS /fp:precise /Qspectre /Zc:wchar_t /Zc:forScope /Zc:inli
  728.   ne /Fo"Win32Release" /Fd"Win32Releasevc141.pdb" /Gd /TC /analyze- /FC /errorReport:queue ......testtestgestu
  729.   re.c
  730.   testgesture.c
  731. Link:
  732.   C:Program Files (x86)Microsoft Visual Studio2017EnterpriseVCToolsMSVC14.16.27023binHostX86x86link.exe /ER
  733.   RORREPORT:QUEUE /OUT:"Z:bzflag-dependenciessrcSDL2VisualCWin32Releasetestgesture.exe" /NOLOGO kernel32.lib use
  734.   r32.lib gdi32.lib winspool.lib comdlg32.lib advapi32.lib shell32.lib ole32.lib oleaut32.lib uuid.lib odbc32.lib odbcc
  735.   p32.lib /MANIFEST /MANIFESTUAC:"level='asInvoker' uiAccess='false'" /manifest:embed /DEBUG:FULL /PDB:"Z:bzflag-depen
  736.   denciessrcSDL2VisualCWin32Releasetestgesture.pdb" /SUBSYSTEM:WINDOWS /TLBID:1 /DYNAMICBASE /NXCOMPAT /IMPLIB:"Z
  737.   :bzflag-dependenciessrcSDL2VisualCWin32Releasetestgesture.lib" /MACHINE:X86 /SAFESEH Win32Releasetestgesture
  738.   .obj
  739.   "Z:bzflag-dependenciessrcSDL2VisualCWin32ReleaseSDL2.lib"
  740.   "Z:bzflag-dependenciessrcSDL2VisualCWin32ReleaseSDL2main.lib"
  741.   "Z:bzflag-dependenciessrcSDL2VisualCWin32ReleaseSDL2test.lib"
  742.   testgesture.vcxproj -> Z:bzflag-dependenciessrcSDL2VisualCWin32Releasetestgesture.exe
  743. FinalizeBuildStatus:
  744.   Deleting file "Win32Releasetestgesture.tlogunsuccessfulbuild".
  745.   Touching "Win32Releasetestgesture.tlogtestgesture.lastbuildstate".
  746. Done Building Project "Z:bzflag-dependenciessrcSDL2VisualCteststestgesturetestgesture.vcxproj" (default targets)
  747. .
  748.  
  749. Project "Z:bzflag-dependenciessrcSDL2VisualCSDL.sln" (1) is building "Z:bzflag-dependenciessrcSDL2VisualCtest
  750. stestgl2testgl2.vcxproj" (12) on node 1 (default targets).
  751. PrepareForBuild:
  752.   Creating directory "Win32Releasetestgl2.tlog".
  753. InitializeBuildStatus:
  754.   Creating "Win32Releasetestgl2.tlogunsuccessfulbuild" because "AlwaysCreate" was specified.
  755. ClCompile:
  756.   C:Program Files (x86)Microsoft Visual Studio2017EnterpriseVCToolsMSVC14.16.27023binHostX86x86CL.exe /c /I
  757.   "Z:bzflag-dependenciessrcSDL2VisualC/../include" /Zi /nologo /W3 /WX- /diagnostics:classic /O2 /Oy- /D NDEBUG /D
  758.    WIN32 /D _WINDOWS /D HAVE_OPENGL /D _VC80_UPGRADE=0x0700 /Gm- /EHsc /MD /GS /fp:precise /Qspectre /Zc:wchar_t /Zc:fo
  759.   rScope /Zc:inline /Fo"Win32Release" /Fd"Win32Releasevc141.pdb" /Gd /TC /analyze- /FC /errorReport:queue ......
  760.   testtestgl2.c
  761.   testgl2.c
  762. Link:
  763.   C:Program Files (x86)Microsoft Visual Studio2017EnterpriseVCToolsMSVC14.16.27023binHostX86x86link.exe /ER
  764.   RORREPORT:QUEUE /OUT:"Z:bzflag-dependenciessrcSDL2VisualCWin32Releasetestgl2.exe" /NOLOGO opengl32.lib kernel3
  765.   2.lib user32.lib gdi32.lib winspool.lib comdlg32.lib advapi32.lib shell32.lib ole32.lib oleaut32.lib uuid.lib odbc32.
  766.   lib odbccp32.lib /MANIFEST /MANIFESTUAC:"level='asInvoker' uiAccess='false'" /manifest:embed /DEBUG:FULL /PDB:"Z:bzf
  767.   lag-dependenciessrcSDL2VisualCWin32Releasetestgl2.pdb" /SUBSYSTEM:WINDOWS /TLBID:1 /DYNAMICBASE /NXCOMPAT /IMPL
  768.   IB:"Z:bzflag-dependenciessrcSDL2VisualCWin32Releasetestgl2.lib" /MACHINE:X86 /SAFESEH Win32Releasetestgl2.ob
  769.   j
  770.   "Z:bzflag-dependenciessrcSDL2VisualCWin32ReleaseSDL2.lib"
  771.   "Z:bzflag-dependenciessrcSDL2VisualCWin32ReleaseSDL2main.lib"
  772.   "Z:bzflag-dependenciessrcSDL2VisualCWin32ReleaseSDL2test.lib"
  773.   testgl2.vcxproj -> Z:bzflag-dependenciessrcSDL2VisualCWin32Releasetestgl2.exe
  774. FinalizeBuildStatus:
  775.   Deleting file "Win32Releasetestgl2.tlogunsuccessfulbuild".
  776.   Touching "Win32Releasetestgl2.tlogtestgl2.lastbuildstate".
  777. Done Building Project "Z:bzflag-dependenciessrcSDL2VisualCteststestgl2testgl2.vcxproj" (default targets).
  778.  
  779. Project "Z:bzflag-dependenciessrcSDL2VisualCSDL.sln" (1) is building "Z:bzflag-dependenciessrcSDL2VisualCtest
  780. stestjoysticktestjoystick.vcxproj" (13) on node 1 (default targets).
  781. PrepareForBuild:
  782.   Creating directory "Win32Releasetestjoystick.tlog".
  783. InitializeBuildStatus:
  784.   Creating "Win32Releasetestjoystick.tlogunsuccessfulbuild" because "AlwaysCreate" was specified.
  785. ClCompile:
  786.   C:Program Files (x86)Microsoft Visual Studio2017EnterpriseVCToolsMSVC14.16.27023binHostX86x86CL.exe /c /I
  787.   "Z:bzflag-dependenciessrcSDL2VisualC/../include" /Zi /nologo /W3 /WX- /diagnostics:classic /O2 /Oy- /D WIN32 /D
  788.   NDEBUG /D _WINDOWS /D _VC80_UPGRADE=0x0700 /Gm- /EHsc /MD /GS /fp:precise /Qspectre /Zc:wchar_t /Zc:forScope /Zc:inli
  789.   ne /Fo"Win32Release" /Fd"Win32Releasevc141.pdb" /Gd /TC /analyze- /FC /errorReport:queue ......testtestjoyst
  790.   ick.c
  791.   testjoystick.c
  792. Link:
  793.   C:Program Files (x86)Microsoft Visual Studio2017EnterpriseVCToolsMSVC14.16.27023binHostX86x86link.exe /ER
  794.   RORREPORT:QUEUE /OUT:"Z:bzflag-dependenciessrcSDL2VisualCWin32Releasetestjoystick.exe" /NOLOGO kernel32.lib us
  795.   er32.lib gdi32.lib winspool.lib comdlg32.lib advapi32.lib shell32.lib ole32.lib oleaut32.lib uuid.lib odbc32.lib odbc
  796.   cp32.lib /MANIFEST /MANIFESTUAC:"level='asInvoker' uiAccess='false'" /manifest:embed /DEBUG:FULL /PDB:"Z:bzflag-depe
  797.   ndenciessrcSDL2VisualCWin32Releasetestjoystick.pdb" /SUBSYSTEM:WINDOWS /TLBID:1 /DYNAMICBASE /NXCOMPAT /IMPLIB:
  798.   "Z:bzflag-dependenciessrcSDL2VisualCWin32Releasetestjoystick.lib" /MACHINE:X86 /SAFESEH Win32Releasetestjoys
  799.   tick.obj
  800.   "Z:bzflag-dependenciessrcSDL2VisualCWin32ReleaseSDL2.lib"
  801.   "Z:bzflag-dependenciessrcSDL2VisualCWin32ReleaseSDL2main.lib"
  802.   testjoystick.vcxproj -> Z:bzflag-dependenciessrcSDL2VisualCWin32Releasetestjoystick.exe
  803. FinalizeBuildStatus:
  804.   Deleting file "Win32Releasetestjoystick.tlogunsuccessfulbuild".
  805.   Touching "Win32Releasetestjoystick.tlogtestjoystick.lastbuildstate".
  806. Done Building Project "Z:bzflag-dependenciessrcSDL2VisualCteststestjoysticktestjoystick.vcxproj" (default target
  807. s).
  808.  
  809. Project "Z:bzflag-dependenciessrcSDL2VisualCSDL.sln" (1) is building "Z:bzflag-dependenciessrcSDL2VisualCtest
  810. stestoverlay2testoverlay2.vcxproj" (14) on node 1 (default targets).
  811. PrepareForBuild:
  812.   Creating directory "Win32Releasetestoverlay2.tlog".
  813. InitializeBuildStatus:
  814.   Creating "Win32Releasetestoverlay2.tlogunsuccessfulbuild" because "AlwaysCreate" was specified.
  815. CustomBuild:
  816.   Copying moose.dat
  817.           1 file(s) copied.
  818. ClCompile:
  819.   C:Program Files (x86)Microsoft Visual Studio2017EnterpriseVCToolsMSVC14.16.27023binHostX86x86CL.exe /c /I
  820.   "Z:bzflag-dependenciessrcSDL2VisualC/../include" /Zi /nologo /W3 /WX- /diagnostics:classic /O2 /Oy- /D WIN32 /D
  821.   NDEBUG /D _WINDOWS /D _VC80_UPGRADE=0x0700 /Gm- /EHsc /MD /GS /fp:precise /Qspectre /Zc:wchar_t /Zc:forScope /Zc:inli
  822.   ne /Fo"Win32Release" /Fd"Win32Releasevc141.pdb" /Gd /TC /analyze- /FC /errorReport:queue ......testtestoverl
  823.   ay2.c ......testtestutils.c ......testtestyuv_cvt.c
  824.   testoverlay2.c
  825.   testutils.c
  826.   testyuv_cvt.c
  827.   Generating Code...
  828. Link:
  829.   C:Program Files (x86)Microsoft Visual Studio2017EnterpriseVCToolsMSVC14.16.27023binHostX86x86link.exe /ER
  830.   RORREPORT:QUEUE /OUT:"Z:bzflag-dependenciessrcSDL2VisualCWin32Releasetestoverlay2.exe" /NOLOGO kernel32.lib us
  831.   er32.lib gdi32.lib winspool.lib comdlg32.lib advapi32.lib shell32.lib ole32.lib oleaut32.lib uuid.lib odbc32.lib odbc
  832.   cp32.lib /MANIFEST /MANIFESTUAC:"level='asInvoker' uiAccess='false'" /manifest:embed /DEBUG:FULL /PDB:"Z:bzflag-depe
  833.   ndenciessrcSDL2VisualCWin32Releasetestoverlay2.pdb" /SUBSYSTEM:WINDOWS /TLBID:1 /DYNAMICBASE /NXCOMPAT /IMPLIB:
  834.   "Z:bzflag-dependenciessrcSDL2VisualCWin32Releasetestoverlay2.lib" /MACHINE:X86 /SAFESEH Win32Releasetestover
  835.   lay2.obj
  836.   Win32Releasetestutils.obj
  837.   Win32Releasetestyuv_cvt.obj
  838.   "Z:bzflag-dependenciessrcSDL2VisualCWin32ReleaseSDL2.lib"
  839.   "Z:bzflag-dependenciessrcSDL2VisualCWin32ReleaseSDL2main.lib"
  840.   testoverlay2.vcxproj -> Z:bzflag-dependenciessrcSDL2VisualCWin32Releasetestoverlay2.exe
  841. FinalizeBuildStatus:
  842.   Deleting file "Win32Releasetestoverlay2.tlogunsuccessfulbuild".
  843.   Touching "Win32Releasetestoverlay2.tlogtestoverlay2.lastbuildstate".
  844. Done Building Project "Z:bzflag-dependenciessrcSDL2VisualCteststestoverlay2testoverlay2.vcxproj" (default target
  845. s).
  846.  
  847. Project "Z:bzflag-dependenciessrcSDL2VisualCSDL.sln" (1) is building "Z:bzflag-dependenciessrcSDL2VisualCtest
  848. stestplatformtestplatform.vcxproj" (15) on node 1 (default targets).
  849. PrepareForBuild:
  850.   Creating directory "Win32Releasetestplatform.tlog".
  851. InitializeBuildStatus:
  852.   Creating "Win32Releasetestplatform.tlogunsuccessfulbuild" because "AlwaysCreate" was specified.
  853. ClCompile:
  854.   C:Program Files (x86)Microsoft Visual Studio2017EnterpriseVCToolsMSVC14.16.27023binHostX86x86CL.exe /c /I
  855.   "Z:bzflag-dependenciessrcSDL2VisualC/../include" /Zi /nologo /W3 /WX- /diagnostics:classic /O2 /Oy- /D WIN32 /D
  856.   NDEBUG /D _WINDOWS /D _VC80_UPGRADE=0x0600 /Gm- /EHsc /MD /GS /fp:precise /Qspectre /Zc:wchar_t /Zc:forScope /Zc:inli
  857.   ne /Fo"Win32Release" /Fd"Win32Releasevc141.pdb" /Gd /TC /analyze- /FC /errorReport:queue ......Testtestplatf
  858.   orm.c
  859.   testplatform.c
  860. Link:
  861.   C:Program Files (x86)Microsoft Visual Studio2017EnterpriseVCToolsMSVC14.16.27023binHostX86x86link.exe /ER
  862.   RORREPORT:QUEUE /OUT:"Z:bzflag-dependenciessrcSDL2VisualCWin32Releasetestplatform.exe" /NOLOGO kernel32.lib us
  863.   er32.lib gdi32.lib winspool.lib comdlg32.lib advapi32.lib shell32.lib ole32.lib oleaut32.lib uuid.lib odbc32.lib odbc
  864.   cp32.lib /MANIFEST /MANIFESTUAC:"level='asInvoker' uiAccess='false'" /manifest:embed /DEBUG:FULL /PDB:"Z:bzflag-depe
  865.   ndenciessrcSDL2VisualCWin32Releasetestplatform.pdb" /SUBSYSTEM:WINDOWS /TLBID:1 /DYNAMICBASE /NXCOMPAT /IMPLIB:
  866.   "Z:bzflag-dependenciessrcSDL2VisualCWin32Releasetestplatform.lib" /MACHINE:X86 /SAFESEH Win32Releasetestplat
  867.   form.obj
  868.   "Z:bzflag-dependenciessrcSDL2VisualCWin32ReleaseSDL2.lib"
  869.   "Z:bzflag-dependenciessrcSDL2VisualCWin32ReleaseSDL2main.lib"
  870.   testplatform.vcxproj -> Z:bzflag-dependenciessrcSDL2VisualCWin32Releasetestplatform.exe
  871. FinalizeBuildStatus:
  872.   Deleting file "Win32Releasetestplatform.tlogunsuccessfulbuild".
  873.   Touching "Win32Releasetestplatform.tlogtestplatform.lastbuildstate".
  874. Done Building Project "Z:bzflag-dependenciessrcSDL2VisualCteststestplatformtestplatform.vcxproj" (default target
  875. s).
  876.  
  877. Project "Z:bzflag-dependenciessrcSDL2VisualCSDL.sln" (1) is building "Z:bzflag-dependenciessrcSDL2VisualCtest
  878. stestpowertestpower.vcxproj" (16) on node 1 (default targets).
  879. PrepareForBuild:
  880.   Creating directory "Win32Releasetestpower.tlog".
  881. InitializeBuildStatus:
  882.   Creating "Win32Releasetestpower.tlogunsuccessfulbuild" because "AlwaysCreate" was specified.
  883. ClCompile:
  884.   C:Program Files (x86)Microsoft Visual Studio2017EnterpriseVCToolsMSVC14.16.27023binHostX86x86CL.exe /c /I
  885.   "Z:bzflag-dependenciessrcSDL2VisualC/../include" /Zi /nologo /W3 /WX- /diagnostics:classic /O2 /Oy- /D WIN32 /D
  886.   NDEBUG /D _WINDOWS /D _VC80_UPGRADE=0x0700 /Gm- /EHsc /MD /GS /fp:precise /Qspectre /Zc:wchar_t /Zc:forScope /Zc:inli
  887.   ne /Fo"Win32Release" /Fd"Win32Releasevc141.pdb" /Gd /TC /analyze- /FC /errorReport:queue ......testtestpower
  888.   .c
  889.   testpower.c
  890. Link:
  891.   C:Program Files (x86)Microsoft Visual Studio2017EnterpriseVCToolsMSVC14.16.27023binHostX86x86link.exe /ER
  892.   RORREPORT:QUEUE /OUT:"Z:bzflag-dependenciessrcSDL2VisualCWin32Releasetestpower.exe" /NOLOGO kernel32.lib user3
  893.   2.lib gdi32.lib winspool.lib comdlg32.lib advapi32.lib shell32.lib ole32.lib oleaut32.lib uuid.lib odbc32.lib odbccp3
  894.   2.lib /MANIFEST /MANIFESTUAC:"level='asInvoker' uiAccess='false'" /manifest:embed /DEBUG:FULL /PDB:"Z:bzflag-depende
  895.   nciessrcSDL2VisualCWin32Releasetestpower.pdb" /SUBSYSTEM:WINDOWS /TLBID:1 /DYNAMICBASE /NXCOMPAT /IMPLIB:"Z:bz
  896.   flag-dependenciessrcSDL2VisualCWin32Releasetestpower.lib" /MACHINE:X86 /SAFESEH Win32Releasetestpower.obj
  897.   "Z:bzflag-dependenciessrcSDL2VisualCWin32ReleaseSDL2.lib"
  898.   "Z:bzflag-dependenciessrcSDL2VisualCWin32ReleaseSDL2main.lib"
  899.   testpower.vcxproj -> Z:bzflag-dependenciessrcSDL2VisualCWin32Releasetestpower.exe
  900. FinalizeBuildStatus:
  901.   Deleting file "Win32Releasetestpower.tlogunsuccessfulbuild".
  902.   Touching "Win32Releasetestpower.tlogtestpower.lastbuildstate".
  903. Done Building Project "Z:bzflag-dependenciessrcSDL2VisualCteststestpowertestpower.vcxproj" (default targets).
  904.  
  905. Project "Z:bzflag-dependenciessrcSDL2VisualCSDL.sln" (1) is building "Z:bzflag-dependenciessrcSDL2VisualCtest
  906. stestrendertargettestrendertarget.vcxproj" (17) on node 1 (default targets).
  907. PrepareForBuild:
  908.   Creating directory "Win32Releasetestrendertarget.tlog".
  909. InitializeBuildStatus:
  910.   Creating "Win32Releasetestrendertarget.tlogunsuccessfulbuild" because "AlwaysCreate" was specified.
  911. CustomBuild:
  912.   Copying icon.bmp
  913.           1 file(s) copied.
  914.   Copying sample.bmp
  915.           1 file(s) copied.
  916. ClCompile:
  917.   C:Program Files (x86)Microsoft Visual Studio2017EnterpriseVCToolsMSVC14.16.27023binHostX86x86CL.exe /c /I
  918.   "Z:bzflag-dependenciessrcSDL2VisualC/../include" /Zi /nologo /W3 /WX- /diagnostics:classic /O2 /Oy- /D WIN32 /D
  919.   NDEBUG /D _WINDOWS /D _VC80_UPGRADE=0x0700 /Gm- /EHsc /MD /GS /fp:precise /Qspectre /Zc:wchar_t /Zc:forScope /Zc:inli
  920.   ne /Fo"Win32Release" /Fd"Win32Releasevc141.pdb" /Gd /TC /analyze- /FC /errorReport:queue ......testtestrende
  921.   rtarget.c ......testtestutils.c
  922.   testrendertarget.c
  923.   testutils.c
  924.   Generating Code...
  925. Link:
  926.   C:Program Files (x86)Microsoft Visual Studio2017EnterpriseVCToolsMSVC14.16.27023binHostX86x86link.exe /ER
  927.   RORREPORT:QUEUE /OUT:"Z:bzflag-dependenciessrcSDL2VisualCWin32Releasetestrendertarget.exe" /NOLOGO kernel32.li
  928.   b user32.lib gdi32.lib winspool.lib comdlg32.lib advapi32.lib shell32.lib ole32.lib oleaut32.lib uuid.lib odbc32.lib
  929.   odbccp32.lib /MANIFEST /MANIFESTUAC:"level='asInvoker' uiAccess='false'" /manifest:embed /DEBUG:FULL /PDB:"Z:bzflag-
  930.   dependenciessrcSDL2VisualCWin32Releasetestrendertarget.pdb" /SUBSYSTEM:WINDOWS /TLBID:1 /DYNAMICBASE /NXCOMPAT
  931.   /IMPLIB:"Z:bzflag-dependenciessrcSDL2VisualCWin32Releasetestrendertarget.lib" /MACHINE:X86 /SAFESEH Win32Rele
  932.   asetestrendertarget.obj
  933.   Win32Releasetestutils.obj
  934.   "Z:bzflag-dependenciessrcSDL2VisualCWin32ReleaseSDL2.lib"
  935.   "Z:bzflag-dependenciessrcSDL2VisualCWin32ReleaseSDL2main.lib"
  936.   "Z:bzflag-dependenciessrcSDL2VisualCWin32ReleaseSDL2test.lib"
  937.   testrendertarget.vcxproj -> Z:bzflag-dependenciessrcSDL2VisualCWin32Releasetestrendertarget.exe
  938. FinalizeBuildStatus:
  939.   Deleting file "Win32Releasetestrendertarget.tlogunsuccessfulbuild".
  940.   Touching "Win32Releasetestrendertarget.tlogtestrendertarget.lastbuildstate".
  941. Done Building Project "Z:bzflag-dependenciessrcSDL2VisualCteststestrendertargettestrendertarget.vcxproj" (defaul
  942. t targets).
  943.  
  944. Project "Z:bzflag-dependenciessrcSDL2VisualCSDL.sln" (1) is building "Z:bzflag-dependenciessrcSDL2VisualCtest
  945. stestrumbletestrumble.vcxproj" (18) on node 1 (default targets).
  946. PrepareForBuild:
  947.   Creating directory "Win32Releasetestrumble.tlog".
  948. InitializeBuildStatus:
  949.   Creating "Win32Releasetestrumble.tlogunsuccessfulbuild" because "AlwaysCreate" was specified.
  950. ClCompile:
  951.   C:Program Files (x86)Microsoft Visual Studio2017EnterpriseVCToolsMSVC14.16.27023binHostX86x86CL.exe /c /I
  952.   "Z:bzflag-dependenciessrcSDL2VisualC/../include" /Zi /nologo /W3 /WX- /diagnostics:classic /O2 /Oy- /D WIN32 /D
  953.   NDEBUG /D _WINDOWS /D _VC80_UPGRADE=0x0700 /Gm- /EHsc /MD /GS /fp:precise /Qspectre /Zc:wchar_t /Zc:forScope /Zc:inli
  954.   ne /Fo"Win32Release" /Fd"Win32Releasevc141.pdb" /Gd /TC /analyze- /FC /errorReport:queue ......testtestrumbl
  955.   e.c
  956.   testrumble.c
  957. Link:
  958.   C:Program Files (x86)Microsoft Visual Studio2017EnterpriseVCToolsMSVC14.16.27023binHostX86x86link.exe /ER
  959.   RORREPORT:QUEUE /OUT:"Z:bzflag-dependenciessrcSDL2VisualCWin32Releasetestrumble.exe" /NOLOGO kernel32.lib user
  960.   32.lib gdi32.lib winspool.lib comdlg32.lib advapi32.lib shell32.lib ole32.lib oleaut32.lib uuid.lib odbc32.lib odbccp
  961.   32.lib /MANIFEST /MANIFESTUAC:"level='asInvoker' uiAccess='false'" /manifest:embed /DEBUG:FULL /PDB:"Z:bzflag-depend
  962.   enciessrcSDL2VisualCWin32Releasetestrumble.pdb" /SUBSYSTEM:WINDOWS /TLBID:1 /DYNAMICBASE /NXCOMPAT /IMPLIB:"Z:
  963.   bzflag-dependenciessrcSDL2VisualCWin32Releasetestrumble.lib" /MACHINE:X86 /SAFESEH Win32Releasetestrumble.obj
  964.   "Z:bzflag-dependenciessrcSDL2VisualCWin32ReleaseSDL2.lib"
  965.   "Z:bzflag-dependenciessrcSDL2VisualCWin32ReleaseSDL2main.lib"
  966.   testrumble.vcxproj -> Z:bzflag-dependenciessrcSDL2VisualCWin32Releasetestrumble.exe
  967. FinalizeBuildStatus:
  968.   Deleting file "Win32Releasetestrumble.tlogunsuccessfulbuild".
  969.   Touching "Win32Releasetestrumble.tlogtestrumble.lastbuildstate".
  970. Done Building Project "Z:bzflag-dependenciessrcSDL2VisualCteststestrumbletestrumble.vcxproj" (default targets).
  971.  
  972. Project "Z:bzflag-dependenciessrcSDL2VisualCSDL.sln" (1) is building "Z:bzflag-dependenciessrcSDL2VisualCtest
  973. stestscaletestscale.vcxproj" (19) on node 1 (default targets).
  974. PrepareForBuild:
  975.   Creating directory "Win32Releasetestscale.tlog".
  976. InitializeBuildStatus:
  977.   Creating "Win32Releasetestscale.tlogunsuccessfulbuild" because "AlwaysCreate" was specified.
  978. CustomBuild:
  979.   Copying icon.bmp
  980.           1 file(s) copied.
  981.   Copying sample.bmp
  982.           1 file(s) copied.
  983. ClCompile:
  984.   C:Program Files (x86)Microsoft Visual Studio2017EnterpriseVCToolsMSVC14.16.27023binHostX86x86CL.exe /c /I
  985.   "Z:bzflag-dependenciessrcSDL2VisualC/../include" /Zi /nologo /W3 /WX- /diagnostics:classic /O2 /Oy- /D WIN32 /D
  986.   NDEBUG /D _WINDOWS /D _VC80_UPGRADE=0x0700 /Gm- /EHsc /MD /GS /fp:precise /Qspectre /Zc:wchar_t /Zc:forScope /Zc:inli
  987.   ne /Fo"Win32Release" /Fd"Win32Releasevc141.pdb" /Gd /TC /analyze- /FC /errorReport:queue ......testtestscale
  988.   .c ......testtestutils.c
  989.   testscale.c
  990.   testutils.c
  991.   Generating Code...
  992. Link:
  993.   C:Program Files (x86)Microsoft Visual Studio2017EnterpriseVCToolsMSVC14.16.27023binHostX86x86link.exe /ER
  994.   RORREPORT:QUEUE /OUT:"Z:bzflag-dependenciessrcSDL2VisualCWin32Releasetestscale.exe" /NOLOGO kernel32.lib user3
  995.   2.lib gdi32.lib winspool.lib comdlg32.lib advapi32.lib shell32.lib ole32.lib oleaut32.lib uuid.lib odbc32.lib odbccp3
  996.   2.lib /MANIFEST /MANIFESTUAC:"level='asInvoker' uiAccess='false'" /manifest:embed /DEBUG:FULL /PDB:"Z:bzflag-depende
  997.   nciessrcSDL2VisualCWin32Releasetestscale.pdb" /SUBSYSTEM:WINDOWS /TLBID:1 /DYNAMICBASE /NXCOMPAT /IMPLIB:"Z:bz
  998.   flag-dependenciessrcSDL2VisualCWin32Releasetestscale.lib" /MACHINE:X86 /SAFESEH Win32Releasetestscale.obj
  999.   Win32Releasetestutils.obj
  1000.   "Z:bzflag-dependenciessrcSDL2VisualCWin32ReleaseSDL2.lib"
  1001.   "Z:bzflag-dependenciessrcSDL2VisualCWin32ReleaseSDL2main.lib"
  1002.   "Z:bzflag-dependenciessrcSDL2VisualCWin32ReleaseSDL2test.lib"
  1003.   testscale.vcxproj -> Z:bzflag-dependenciessrcSDL2VisualCWin32Releasetestscale.exe
  1004. FinalizeBuildStatus:
  1005.   Deleting file "Win32Releasetestscale.tlogunsuccessfulbuild".
  1006.   Touching "Win32Releasetestscale.tlogtestscale.lastbuildstate".
  1007. Done Building Project "Z:bzflag-dependenciessrcSDL2VisualCteststestscaletestscale.vcxproj" (default targets).
  1008.  
  1009. Project "Z:bzflag-dependenciessrcSDL2VisualCSDL.sln" (1) is building "Z:bzflag-dependenciessrcSDL2VisualCtest
  1010. stestshapetestshape.vcxproj" (20) on node 1 (default targets).
  1011. PrepareForBuild:
  1012.   Creating directory "Win32Releasetestshape.tlog".
  1013. InitializeBuildStatus:
  1014.   Creating "Win32Releasetestshape.tlogunsuccessfulbuild" because "AlwaysCreate" was specified.
  1015. ClCompile:
  1016.   C:Program Files (x86)Microsoft Visual Studio2017EnterpriseVCToolsMSVC14.16.27023binHostX86x86CL.exe /c /I
  1017.   "Z:bzflag-dependenciessrcSDL2VisualC/../include" /Zi /nologo /W3 /WX- /diagnostics:classic /O2 /Oy- /D WIN32 /D
  1018.   NDEBUG /D _WINDOWS /D _VC80_UPGRADE=0x0700 /Gm- /EHsc /MD /GS /fp:precise /Qspectre /Zc:wchar_t /Zc:forScope /Zc:inli
  1019.   ne /Fo"Win32Release" /Fd"Win32Releasevc141.pdb" /Gd /TC /analyze- /FC /errorReport:queue ......testtestshape
  1020.   .c
  1021.   testshape.c
  1022. Link:
  1023.   C:Program Files (x86)Microsoft Visual Studio2017EnterpriseVCToolsMSVC14.16.27023binHostX86x86link.exe /ER
  1024.   RORREPORT:QUEUE /OUT:"Z:bzflag-dependenciessrcSDL2VisualCWin32Releasetestshape.exe" /NOLOGO kernel32.lib user3
  1025.   2.lib gdi32.lib winspool.lib comdlg32.lib advapi32.lib shell32.lib ole32.lib oleaut32.lib uuid.lib odbc32.lib odbccp3
  1026.   2.lib /MANIFEST /MANIFESTUAC:"level='asInvoker' uiAccess='false'" /manifest:embed /DEBUG:FULL /PDB:"Z:bzflag-depende
  1027.   nciessrcSDL2VisualCWin32Releasetestshape.pdb" /SUBSYSTEM:WINDOWS /TLBID:1 /DYNAMICBASE /NXCOMPAT /IMPLIB:"Z:bz
  1028.   flag-dependenciessrcSDL2VisualCWin32Releasetestshape.lib" /MACHINE:X86 /SAFESEH Win32Releasetestshape.obj
  1029.   "Z:bzflag-dependenciessrcSDL2VisualCWin32ReleaseSDL2.lib"
  1030.   "Z:bzflag-dependenciessrcSDL2VisualCWin32ReleaseSDL2main.lib"
  1031.   testshape.vcxproj -> Z:bzflag-dependenciessrcSDL2VisualCWin32Releasetestshape.exe
  1032. FinalizeBuildStatus:
  1033.   Deleting file "Win32Releasetestshape.tlogunsuccessfulbuild".
  1034.   Touching "Win32Releasetestshape.tlogtestshape.lastbuildstate".
  1035. Done Building Project "Z:bzflag-dependenciessrcSDL2VisualCteststestshapetestshape.vcxproj" (default targets).
  1036.  
  1037. Project "Z:bzflag-dependenciessrcSDL2VisualCSDL.sln" (1) is building "Z:bzflag-dependenciessrcSDL2VisualCtest
  1038. stestsprite2testsprite2.vcxproj" (21) on node 1 (default targets).
  1039. PrepareForBuild:
  1040.   Creating directory "Win32Releasetestsprite2.tlog".
  1041. InitializeBuildStatus:
  1042.   Creating "Win32Releasetestsprite2.tlogunsuccessfulbuild" because "AlwaysCreate" was specified.
  1043. CustomBuild:
  1044.   Copying icon.bmp
  1045.           1 file(s) copied.
  1046. ClCompile:
  1047.   C:Program Files (x86)Microsoft Visual Studio2017EnterpriseVCToolsMSVC14.16.27023binHostX86x86CL.exe /c /I
  1048.   "Z:bzflag-dependenciessrcSDL2VisualC/../include" /Zi /nologo /W3 /WX- /diagnostics:classic /O2 /Oy- /D WIN32 /D
  1049.   NDEBUG /D _WINDOWS /D _VC80_UPGRADE=0x0700 /Gm- /EHsc /MD /GS /fp:precise /Qspectre /Zc:wchar_t /Zc:forScope /Zc:inli
  1050.   ne /Fo"Win32Release" /Fd"Win32Releasevc141.pdb" /Gd /TC /analyze- /FC /errorReport:queue ......testtestsprit
  1051.   e2.c ......testtestutils.c
  1052.   testsprite2.c
  1053.   testutils.c
  1054.   Generating Code...
  1055. Link:
  1056.   C:Program Files (x86)Microsoft Visual Studio2017EnterpriseVCToolsMSVC14.16.27023binHostX86x86link.exe /ER
  1057.   RORREPORT:QUEUE /OUT:"Z:bzflag-dependenciessrcSDL2VisualCWin32Releasetestsprite2.exe" /NOLOGO kernel32.lib use
  1058.   r32.lib gdi32.lib winspool.lib comdlg32.lib advapi32.lib shell32.lib ole32.lib oleaut32.lib uuid.lib odbc32.lib odbcc
  1059.   p32.lib /MANIFEST /MANIFESTUAC:"level='asInvoker' uiAccess='false'" /manifest:embed /DEBUG:FULL /PDB:"Z:bzflag-depen
  1060.   denciessrcSDL2VisualCWin32Releasetestsprite2.pdb" /SUBSYSTEM:WINDOWS /TLBID:1 /DYNAMICBASE /NXCOMPAT /IMPLIB:"Z
  1061.   :bzflag-dependenciessrcSDL2VisualCWin32Releasetestsprite2.lib" /MACHINE:X86 /SAFESEH Win32Releasetestsprite2
  1062.   .obj
  1063.   Win32Releasetestutils.obj
  1064.   "Z:bzflag-dependenciessrcSDL2VisualCWin32ReleaseSDL2.lib"
  1065.   "Z:bzflag-dependenciessrcSDL2VisualCWin32ReleaseSDL2main.lib"
  1066.   "Z:bzflag-dependenciessrcSDL2VisualCWin32ReleaseSDL2test.lib"
  1067.   testsprite2.vcxproj -> Z:bzflag-dependenciessrcSDL2VisualCWin32Releasetestsprite2.exe
  1068. FinalizeBuildStatus:
  1069.   Deleting file "Win32Releasetestsprite2.tlogunsuccessfulbuild".
  1070.   Touching "Win32Releasetestsprite2.tlogtestsprite2.lastbuildstate".
  1071. Done Building Project "Z:bzflag-dependenciessrcSDL2VisualCteststestsprite2testsprite2.vcxproj" (default targets)
  1072. .
  1073.  
  1074. Project "Z:bzflag-dependenciessrcSDL2VisualCSDL.sln" (1) is building "Z:bzflag-dependenciessrcSDL2VisualCtest
  1075. stestgamecontrollertestgamecontroller.vcxproj" (22) on node 1 (default targets).
  1076. PrepareForBuild:
  1077.   Creating directory "Win32Releasetestgame.55812185.tlog".
  1078. InitializeBuildStatus:
  1079.   Creating "Win32Releasetestgame.55812185.tlogunsuccessfulbuild" because "AlwaysCreate" was specified.
  1080. CustomBuild:
  1081.   Copying axis.bmp
  1082.           1 file(s) copied.
  1083.   Copying button.bmp
  1084.           1 file(s) copied.
  1085.   Copying controllermap.bmp
  1086.           1 file(s) copied.
  1087.   Copying controllermap_back.bmp
  1088.           1 file(s) copied.
  1089. ClCompile:
  1090.   C:Program Files (x86)Microsoft Visual Studio2017EnterpriseVCToolsMSVC14.16.27023binHostX86x86CL.exe /c /I
  1091.   "Z:bzflag-dependenciessrcSDL2VisualC/../include" /Zi /nologo /W3 /WX- /diagnostics:classic /O2 /Oy- /D WIN32 /D
  1092.   NDEBUG /D _WINDOWS /D _VC80_UPGRADE=0x0700 /Gm- /EHsc /MD /GS /fp:precise /Qspectre /Zc:wchar_t /Zc:forScope /Zc:inli
  1093.   ne /Fo"Win32Release" /Fd"Win32Releasevc141.pdb" /Gd /TC /analyze- /FC /errorReport:queue ......testtestgamec
  1094.   ontroller.c ......testtestutils.c
  1095.   testgamecontroller.c
  1096.   testutils.c
  1097.   Generating Code...
  1098. Link:
  1099.   C:Program Files (x86)Microsoft Visual Studio2017EnterpriseVCToolsMSVC14.16.27023binHostX86x86link.exe /ER
  1100.   RORREPORT:QUEUE /OUT:"Z:bzflag-dependenciessrcSDL2VisualCWin32Releasetestgamecontroller.exe" /NOLOGO kernel32.
  1101.   lib user32.lib gdi32.lib winspool.lib comdlg32.lib advapi32.lib shell32.lib ole32.lib oleaut32.lib uuid.lib odbc32.li
  1102.   b odbccp32.lib /MANIFEST /MANIFESTUAC:"level='asInvoker' uiAccess='false'" /manifest:embed /DEBUG:FULL /PDB:"Z:bzfla
  1103.   g-dependenciessrcSDL2VisualCWin32Releasetestgamecontroller.pdb" /SUBSYSTEM:WINDOWS /TLBID:1 /DYNAMICBASE /NXCOM
  1104.   PAT /IMPLIB:"Z:bzflag-dependenciessrcSDL2VisualCWin32Releasetestgamecontroller.lib" /MACHINE:X86 /SAFESEH Win3
  1105.   2Releasetestgamecontroller.obj
  1106.   Win32Releasetestutils.obj
  1107.   "Z:bzflag-dependenciessrcSDL2VisualCWin32ReleaseSDL2.lib"
  1108.   "Z:bzflag-dependenciessrcSDL2VisualCWin32ReleaseSDL2main.lib"
  1109.   testgamecontroller.vcxproj -> Z:bzflag-dependenciessrcSDL2VisualCWin32Releasetestgamecontroller.exe
  1110. FinalizeBuildStatus:
  1111.   Deleting file "Win32Releasetestgame.55812185.tlogunsuccessfulbuild".
  1112.   Touching "Win32Releasetestgame.55812185.tlogtestgamecontroller.lastbuildstate".
  1113. Done Building Project "Z:bzflag-dependenciessrcSDL2VisualCteststestgamecontrollertestgamecontroller.vcxproj" (de
  1114. fault targets).
  1115.  
  1116. Project "Z:bzflag-dependenciessrcSDL2VisualCSDL.sln" (1) is building "Z:bzflag-dependenciessrcSDL2VisualCtest
  1117. stestgles2testgles2.vcxproj" (23) on node 1 (default targets).
  1118. PrepareForBuild:
  1119.   Creating directory "Win32Releasetestgles2.tlog".
  1120. InitializeBuildStatus:
  1121.   Creating "Win32Releasetestgles2.tlogunsuccessfulbuild" because "AlwaysCreate" was specified.
  1122. ClCompile:
  1123.   C:Program Files (x86)Microsoft Visual Studio2017EnterpriseVCToolsMSVC14.16.27023binHostX86x86CL.exe /c /I
  1124.   "Z:bzflag-dependenciessrcSDL2VisualC/../include" /Zi /nologo /W3 /WX- /diagnostics:classic /O2 /Oy- /D NDEBUG /D
  1125.    WIN32 /D _WINDOWS /D HAVE_OPENGL /D _VC80_UPGRADE=0x0700 /Gm- /EHsc /MD /GS /fp:precise /Qspectre /Zc:wchar_t /Zc:fo
  1126.   rScope /Zc:inline /Fo"Win32Release" /Fd"Win32Releasevc141.pdb" /Gd /TC /analyze- /FC /errorReport:queue ......
  1127.   testtestgles2.c
  1128.   testgles2.c
  1129. Link:
  1130.   C:Program Files (x86)Microsoft Visual Studio2017EnterpriseVCToolsMSVC14.16.27023binHostX86x86link.exe /ER
  1131.   RORREPORT:QUEUE /OUT:"Z:bzflag-dependenciessrcSDL2VisualCWin32Releasetestgles2.exe" /NOLOGO opengl32.lib kerne
  1132.   l32.lib user32.lib gdi32.lib winspool.lib comdlg32.lib advapi32.lib shell32.lib ole32.lib oleaut32.lib uuid.lib odbc3
  1133.   2.lib odbccp32.lib /MANIFEST /MANIFESTUAC:"level='asInvoker' uiAccess='false'" /manifest:embed /DEBUG:FULL /PDB:"Z:b
  1134.   zflag-dependenciessrcSDL2VisualCWin32Releasetestgles2.pdb" /SUBSYSTEM:WINDOWS /TLBID:1 /DYNAMICBASE /NXCOMPAT /
  1135.   IMPLIB:"Z:bzflag-dependenciessrcSDL2VisualCWin32Releasetestgles2.lib" /MACHINE:X86 /SAFESEH Win32Releasetest
  1136.   gles2.obj
  1137.   "Z:bzflag-dependenciessrcSDL2VisualCWin32ReleaseSDL2.lib"
  1138.   "Z:bzflag-dependenciessrcSDL2VisualCWin32ReleaseSDL2main.lib"
  1139.   "Z:bzflag-dependenciessrcSDL2VisualCWin32ReleaseSDL2test.lib"
  1140.   testgles2.vcxproj -> Z:bzflag-dependenciessrcSDL2VisualCWin32Releasetestgles2.exe
  1141. FinalizeBuildStatus:
  1142.   Deleting file "Win32Releasetestgles2.tlogunsuccessfulbuild".
  1143.   Touching "Win32Releasetestgles2.tlogtestgles2.lastbuildstate".
  1144. Done Building Project "Z:bzflag-dependenciessrcSDL2VisualCteststestgles2testgles2.vcxproj" (default targets).
  1145.  
  1146. Project "Z:bzflag-dependenciessrcSDL2VisualCSDL.sln" (1) is building "Z:bzflag-dependenciessrcSDL2VisualCtest
  1147. scontrollermapcontrollermap.vcxproj" (24) on node 1 (default targets).
  1148. PrepareForBuild:
  1149.   Creating directory "Win32Releasecontrollermap.tlog".
  1150. InitializeBuildStatus:
  1151.   Creating "Win32Releasecontrollermap.tlogunsuccessfulbuild" because "AlwaysCreate" was specified.
  1152. CustomBuild:
  1153.   Copying axis.bmp
  1154.           1 file(s) copied.
  1155.   Copying button.bmp
  1156.           1 file(s) copied.
  1157.   Copying controllermap.bmp
  1158.           1 file(s) copied.
  1159.   Copying controllermap_back.bmp
  1160.           1 file(s) copied.
  1161. ClCompile:
  1162.   C:Program Files (x86)Microsoft Visual Studio2017EnterpriseVCToolsMSVC14.16.27023binHostX86x86CL.exe /c /I
  1163.   "Z:bzflag-dependenciessrcSDL2VisualC/../include" /Zi /nologo /W3 /WX- /diagnostics:classic /O2 /Oy- /D WIN32 /D
  1164.   NDEBUG /D _WINDOWS /D _VC80_UPGRADE=0x0700 /Gm- /EHsc /MD /GS /fp:precise /Qspectre /Zc:wchar_t /Zc:forScope /Zc:inli
  1165.   ne /Fo"Win32Release" /Fd"Win32Releasevc141.pdb" /Gd /TC /analyze- /FC /errorReport:queue ......testcontrolle
  1166.   rmap.c ......testtestutils.c
  1167.   controllermap.c
  1168.   testutils.c
  1169.   Generating Code...
  1170. Link:
  1171.   C:Program Files (x86)Microsoft Visual Studio2017EnterpriseVCToolsMSVC14.16.27023binHostX86x86link.exe /ER
  1172.   RORREPORT:QUEUE /OUT:"Z:bzflag-dependenciessrcSDL2VisualCWin32Releasecontrollermap.exe" /NOLOGO kernel32.lib u
  1173.   ser32.lib gdi32.lib winspool.lib comdlg32.lib advapi32.lib shell32.lib ole32.lib oleaut32.lib uuid.lib odbc32.lib odb
  1174.   ccp32.lib /MANIFEST /MANIFESTUAC:"level='asInvoker' uiAccess='false'" /manifest:embed /DEBUG:FULL /PDB:"Z:bzflag-dep
  1175.   endenciessrcSDL2VisualCWin32Releasecontrollermap.pdb" /SUBSYSTEM:WINDOWS /TLBID:1 /DYNAMICBASE /NXCOMPAT /IMPLI
  1176.   B:"Z:bzflag-dependenciessrcSDL2VisualCWin32Releasecontrollermap.lib" /MACHINE:X86 /SAFESEH Win32Releasecontr
  1177.   ollermap.obj
  1178.   Win32Releasetestutils.obj
  1179.   "Z:bzflag-dependenciessrcSDL2VisualCWin32ReleaseSDL2.lib"
  1180.   "Z:bzflag-dependenciessrcSDL2VisualCWin32ReleaseSDL2main.lib"
  1181.   controllermap.vcxproj -> Z:bzflag-dependenciessrcSDL2VisualCWin32Releasecontrollermap.exe
  1182. FinalizeBuildStatus:
  1183.   Deleting file "Win32Releasecontrollermap.tlogunsuccessfulbuild".
  1184.   Touching "Win32Releasecontrollermap.tlogcontrollermap.lastbuildstate".
  1185. Done Building Project "Z:bzflag-dependenciessrcSDL2VisualCtestscontrollermapcontrollermap.vcxproj" (default targ
  1186. ets).
  1187.  
  1188. Project "Z:bzflag-dependenciessrcSDL2VisualCSDL.sln" (1) is building "Z:bzflag-dependenciessrcSDL2VisualCtest
  1189. stestvulkantestvulkan.vcxproj" (25) on node 1 (default targets).
  1190. PrepareForBuild:
  1191.   Creating directory "Win32Release".
  1192.   Creating directory "Win32Releasetestvulkan.tlog".
  1193. InitializeBuildStatus:
  1194.   Creating "Win32Releasetestvulkan.tlogunsuccessfulbuild" because "AlwaysCreate" was specified.
  1195. ClCompile:
  1196.   C:Program Files (x86)Microsoft Visual Studio2017EnterpriseVCToolsMSVC14.16.27023binHostX86x86CL.exe /c /I
  1197.   "Z:bzflag-dependenciessrcSDL2VisualC/../include" /Zi /nologo /W3 /WX- /diagnostics:classic /O2 /Oy- /D NDEBUG /D
  1198.    WIN32 /D _WINDOWS /D HAVE_OPENGL /D _VC80_UPGRADE=0x0700 /Gm- /EHsc /MD /GS /fp:precise /Qspectre /Zc:wchar_t /Zc:fo
  1199.   rScope /Zc:inline /Fo"Win32Release" /Fd"Win32Releasevc141.pdb" /Gd /TC /analyze- /FC /errorReport:queue ......
  1200.   testtestvulkan.c
  1201.   testvulkan.c
  1202. Link:
  1203.   C:Program Files (x86)Microsoft Visual Studio2017EnterpriseVCToolsMSVC14.16.27023binHostX86x86link.exe /ER
  1204.   RORREPORT:QUEUE /OUT:"Z:bzflag-dependenciessrcSDL2VisualCWin32Releasetestvulkan.exe" /NOLOGO kernel32.lib user
  1205.   32.lib gdi32.lib winspool.lib comdlg32.lib advapi32.lib shell32.lib ole32.lib oleaut32.lib uuid.lib odbc32.lib odbccp
  1206.   32.lib /MANIFEST /MANIFESTUAC:"level='asInvoker' uiAccess='false'" /manifest:embed /DEBUG:FULL /PDB:"Z:bzflag-depend
  1207.   enciessrcSDL2VisualCWin32Releasetestvulkan.pdb" /SUBSYSTEM:WINDOWS /TLBID:1 /DYNAMICBASE /NXCOMPAT /IMPLIB:"Z:
  1208.   bzflag-dependenciessrcSDL2VisualCWin32Releasetestvulkan.lib" /MACHINE:X86 /SAFESEH Win32Releasetestvulkan.obj
  1209.   "Z:bzflag-dependenciessrcSDL2VisualCWin32ReleaseSDL2main.lib"
  1210.   "Z:bzflag-dependenciessrcSDL2VisualCWin32ReleaseSDL2test.lib"
  1211.   "Z:bzflag-dependenciessrcSDL2VisualCWin32ReleaseSDL2.lib"
  1212.   testvulkan.vcxproj -> Z:bzflag-dependenciessrcSDL2VisualCWin32Releasetestvulkan.exe
  1213. FinalizeBuildStatus:
  1214.   Deleting file "Win32Releasetestvulkan.tlogunsuccessfulbuild".
  1215.   Touching "Win32Releasetestvulkan.tlogtestvulkan.lastbuildstate".
  1216. Done Building Project "Z:bzflag-dependenciessrcSDL2VisualCteststestvulkantestvulkan.vcxproj" (default targets).
  1217.  
  1218. Project "Z:bzflag-dependenciessrcSDL2VisualCSDL.sln" (1) is building "Z:bzflag-dependenciessrcSDL2VisualCtest
  1219. stestwm2testwm2.vcxproj" (26) on node 1 (default targets).
  1220. PrepareForBuild:
  1221.   Creating directory "Win32Release".
  1222.   Creating directory "Win32Releasetestwm2.tlog".
  1223. InitializeBuildStatus:
  1224.   Creating "Win32Releasetestwm2.tlogunsuccessfulbuild" because "AlwaysCreate" was specified.
  1225. ClCompile:
  1226.   C:Program Files (x86)Microsoft Visual Studio2017EnterpriseVCToolsMSVC14.16.27023binHostX86x86CL.exe /c /I
  1227.   "Z:bzflag-dependenciessrcSDL2VisualC/../include" /Zi /nologo /W3 /WX- /diagnostics:classic /O2 /Oy- /D WIN32 /D
  1228.   NDEBUG /D _WINDOWS /D _VC80_UPGRADE=0x0700 /Gm- /EHsc /MD /GS /fp:precise /Qspectre /Zc:wchar_t /Zc:forScope /Zc:inli
  1229.   ne /Fo"Win32Release" /Fd"Win32Releasevc141.pdb" /Gd /TC /analyze- /FC /errorReport:queue ......testtestwm2.c
  1230.   testwm2.c
  1231. Link:
  1232.   C:Program Files (x86)Microsoft Visual Studio2017EnterpriseVCToolsMSVC14.16.27023binHostX86x86link.exe /ER
  1233.   RORREPORT:QUEUE /OUT:"Z:bzflag-dependenciessrcSDL2VisualCWin32Releasetestwm2.exe" /NOLOGO kernel32.lib user32.
  1234.   lib gdi32.lib winspool.lib comdlg32.lib advapi32.lib shell32.lib ole32.lib oleaut32.lib uuid.lib odbc32.lib odbccp32.
  1235.   lib /MANIFEST /MANIFESTUAC:"level='asInvoker' uiAccess='false'" /manifest:embed /DEBUG:FULL /PDB:"Z:bzflag-dependenc
  1236.   iessrcSDL2VisualCWin32Releasetestwm2.pdb" /SUBSYSTEM:WINDOWS /TLBID:1 /DYNAMICBASE /NXCOMPAT /IMPLIB:"Z:bzflag
  1237.   -dependenciessrcSDL2VisualCWin32Releasetestwm2.lib" /MACHINE:X86 /SAFESEH Win32Releasetestwm2.obj
  1238.   "Z:bzflag-dependenciessrcSDL2VisualCWin32ReleaseSDL2.lib"
  1239.   "Z:bzflag-dependenciessrcSDL2VisualCWin32ReleaseSDL2main.lib"
  1240.   "Z:bzflag-dependenciessrcSDL2VisualCWin32ReleaseSDL2test.lib"
  1241.   testwm2.vcxproj -> Z:bzflag-dependenciessrcSDL2VisualCWin32Releasetestwm2.exe
  1242. FinalizeBuildStatus:
  1243.   Deleting file "Win32Releasetestwm2.tlogunsuccessfulbuild".
  1244.   Touching "Win32Releasetestwm2.tlogtestwm2.lastbuildstate".
  1245. Done Building Project "Z:bzflag-dependenciessrcSDL2VisualCteststestwm2testwm2.vcxproj" (default targets).
  1246.  
  1247. Project "Z:bzflag-dependenciessrcSDL2VisualCSDL.sln" (1) is building "Z:bzflag-dependenciessrcSDL2VisualCtest
  1248. stestyuvtestyuv.vcxproj" (27) on node 1 (default targets).
  1249. PrepareForBuild:
  1250.   Creating directory "Win32Release".
  1251.   Creating directory "Win32Releasetestyuv.tlog".
  1252. InitializeBuildStatus:
  1253.   Creating "Win32Releasetestyuv.tlogunsuccessfulbuild" because "AlwaysCreate" was specified.
  1254. CustomBuild:
  1255.   Copying testyuv.bmp
  1256.           1 file(s) copied.
  1257. ClCompile:
  1258.   C:Program Files (x86)Microsoft Visual Studio2017EnterpriseVCToolsMSVC14.16.27023binHostX86x86CL.exe /c /I
  1259.   "Z:bzflag-dependenciessrcSDL2VisualC/../include" /Zi /nologo /W3 /WX- /diagnostics:classic /O2 /Oy- /D WIN32 /D
  1260.   NDEBUG /D _WINDOWS /D _VC80_UPGRADE=0x0700 /Gm- /EHsc /MD /GS /fp:precise /Qspectre /Zc:wchar_t /Zc:forScope /Zc:inli
  1261.   ne /Fo"Win32Release" /Fd"Win32Releasevc141.pdb" /Gd /TC /analyze- /FC /errorReport:queue ......testtestyuv.c
  1262.    ......testtestyuv_cvt.c
  1263.   testyuv.c
  1264.   testyuv_cvt.c
  1265.   Generating Code...
  1266. Link:
  1267.   C:Program Files (x86)Microsoft Visual Studio2017EnterpriseVCToolsMSVC14.16.27023binHostX86x86link.exe /ER
  1268.   RORREPORT:QUEUE /OUT:"Z:bzflag-dependenciessrcSDL2VisualCWin32Releasetestyuv.exe" /NOLOGO kernel32.lib user32.
  1269.   lib gdi32.lib winspool.lib comdlg32.lib advapi32.lib shell32.lib ole32.lib oleaut32.lib uuid.lib odbc32.lib odbccp32.
  1270.   lib /MANIFEST /MANIFESTUAC:"level='asInvoker' uiAccess='false'" /manifest:embed /DEBUG:FULL /PDB:"Z:bzflag-dependenc
  1271.   iessrcSDL2VisualCWin32Releasetestyuv.pdb" /SUBSYSTEM:WINDOWS /TLBID:1 /DYNAMICBASE /NXCOMPAT /IMPLIB:"Z:bzflag
  1272.   -dependenciessrcSDL2VisualCWin32Releasetestyuv.lib" /MACHINE:X86 /SAFESEH Win32Releasetestyuv.obj
  1273.   Win32Releasetestyuv_cvt.obj
  1274.   "Z:bzflag-dependenciessrcSDL2VisualCWin32ReleaseSDL2.lib"
  1275.   "Z:bzflag-dependenciessrcSDL2VisualCWin32ReleaseSDL2main.lib"
  1276.   "Z:bzflag-dependenciessrcSDL2VisualCWin32ReleaseSDL2test.lib"
  1277.   testyuv.vcxproj -> Z:bzflag-dependenciessrcSDL2VisualCWin32Releasetestyuv.exe
  1278. FinalizeBuildStatus:
  1279.   Deleting file "Win32Releasetestyuv.tlogunsuccessfulbuild".
  1280.   Touching "Win32Releasetestyuv.tlogtestyuv.lastbuildstate".
  1281. Done Building Project "Z:bzflag-dependenciessrcSDL2VisualCteststestyuvtestyuv.vcxproj" (default targets).
  1282.  
  1283. Project "Z:bzflag-dependenciessrcSDL2VisualCSDL.sln" (1) is building "Z:bzflag-dependenciessrcSDL2VisualCtest
  1284. stestsensortestsensor.vcxproj" (28) on node 1 (default targets).
  1285. PrepareForBuild:
  1286.   Creating directory "Win32Release".
  1287.   Creating directory "Win32Releasetestsensor.tlog".
  1288. InitializeBuildStatus:
  1289.   Creating "Win32Releasetestsensor.tlogunsuccessfulbuild" because "AlwaysCreate" was specified.
  1290. ClCompile:
  1291.   C:Program Files (x86)Microsoft Visual Studio2017EnterpriseVCToolsMSVC14.16.27023binHostX86x86CL.exe /c /I
  1292.   "Z:bzflag-dependenciessrcSDL2VisualC/../include" /Zi /nologo /W3 /WX- /diagnostics:classic /O2 /Oy- /D WIN32 /D
  1293.   NDEBUG /D _WINDOWS /D _VC80_UPGRADE=0x0700 /Gm- /EHsc /MD /GS /fp:precise /Qspectre /Zc:wchar_t /Zc:forScope /Zc:inli
  1294.   ne /Fo"Win32Release" /Fd"Win32Releasevc141.pdb" /Gd /TC /analyze- /FC /errorReport:queue ......testtestsenso
  1295.   r.c
  1296.   testsensor.c
  1297. Link:
  1298.   C:Program Files (x86)Microsoft Visual Studio2017EnterpriseVCToolsMSVC14.16.27023binHostX86x86link.exe /ER
  1299.   RORREPORT:QUEUE /OUT:"Z:bzflag-dependenciessrcSDL2VisualCWin32Releasetestsensor.exe" /NOLOGO kernel32.lib user
  1300.   32.lib gdi32.lib winspool.lib comdlg32.lib advapi32.lib shell32.lib ole32.lib oleaut32.lib uuid.lib odbc32.lib odbccp
  1301.   32.lib /MANIFEST /MANIFESTUAC:"level='asInvoker' uiAccess='false'" /manifest:embed /DEBUG:FULL /PDB:"Z:bzflag-depend
  1302.   enciessrcSDL2VisualCWin32Releasetestsensor.pdb" /SUBSYSTEM:WINDOWS /TLBID:1 /DYNAMICBASE /NXCOMPAT /IMPLIB:"Z:
  1303.   bzflag-dependenciessrcSDL2VisualCWin32Releasetestsensor.lib" /MACHINE:X86 /SAFESEH Win32Releasetestsensor.obj
  1304.   "Z:bzflag-dependenciessrcSDL2VisualCWin32ReleaseSDL2.lib"
  1305.   "Z:bzflag-dependenciessrcSDL2VisualCWin32ReleaseSDL2main.lib"
  1306.   testsensor.vcxproj -> Z:bzflag-dependenciessrcSDL2VisualCWin32Releasetestsensor.exe
  1307. FinalizeBuildStatus:
  1308.   Deleting file "Win32Releasetestsensor.tlogunsuccessfulbuild".
  1309.   Touching "Win32Releasetestsensor.tlogtestsensor.lastbuildstate".
  1310. Done Building Project "Z:bzflag-dependenciessrcSDL2VisualCteststestsensortestsensor.vcxproj" (default targets).
  1311.  
  1312. Project "Z:bzflag-dependenciessrcSDL2VisualCSDL.sln" (1) is building "Z:bzflag-dependenciessrcSDL2VisualCtest
  1313. stestsurroundtestsurround.vcxproj" (29) on node 1 (default targets).
  1314. PrepareForBuild:
  1315.   Creating directory "Win32Release".
  1316.   Creating directory "Win32Releasetestsurround.tlog".
  1317. InitializeBuildStatus:
  1318.   Creating "Win32Releasetestsurround.tlogunsuccessfulbuild" because "AlwaysCreate" was specified.
  1319. ClCompile:
  1320.   C:Program Files (x86)Microsoft Visual Studio2017EnterpriseVCToolsMSVC14.16.27023binHostX86x86CL.exe /c /I
  1321.   "Z:bzflag-dependenciessrcSDL2VisualC/../include" /Zi /nologo /W3 /WX- /diagnostics:classic /O2 /Oy- /D WIN32 /D
  1322.   NDEBUG /D _WINDOWS /D _VC80_UPGRADE=0x0700 /Gm- /EHsc /MD /GS /fp:precise /Qspectre /Zc:wchar_t /Zc:forScope /Zc:inli
  1323.   ne /Fo"Win32Release" /Fd"Win32Releasevc141.pdb" /Gd /TC /analyze- /FC /errorReport:queue ......Testtestsurro
  1324.   und.c
  1325.   testsurround.c
  1326. Link:
  1327.   C:Program Files (x86)Microsoft Visual Studio2017EnterpriseVCToolsMSVC14.16.27023binHostX86x86link.exe /ER
  1328.   RORREPORT:QUEUE /OUT:"Z:bzflag-dependenciessrcSDL2VisualCWin32Releasetestsurround.exe" /NOLOGO kernel32.lib us
  1329.   er32.lib gdi32.lib winspool.lib comdlg32.lib advapi32.lib shell32.lib ole32.lib oleaut32.lib uuid.lib odbc32.lib odbc
  1330.   cp32.lib /MANIFEST /MANIFESTUAC:"level='asInvoker' uiAccess='false'" /manifest:embed /DEBUG:FULL /PDB:"Z:bzflag-depe
  1331.   ndenciessrcSDL2VisualCWin32Releasetestsurround.pdb" /SUBSYSTEM:CONSOLE /TLBID:1 /DYNAMICBASE /NXCOMPAT /IMPLIB:
  1332.   "Z:bzflag-dependenciessrcSDL2VisualCWin32Releasetestsurround.lib" /MACHINE:X86 /SAFESEH Win32Releasetestsurr
  1333.   ound.obj
  1334.   "Z:bzflag-dependenciessrcSDL2VisualCWin32ReleaseSDL2.lib"
  1335.   "Z:bzflag-dependenciessrcSDL2VisualCWin32ReleaseSDL2main.lib"
  1336.   testsurround.vcxproj -> Z:bzflag-dependenciessrcSDL2VisualCWin32Releasetestsurround.exe
  1337. FinalizeBuildStatus:
  1338.   Deleting file "Win32Releasetestsurround.tlogunsuccessfulbuild".
  1339.   Touching "Win32Releasetestsurround.tlogtestsurround.lastbuildstate".
  1340. Done Building Project "Z:bzflag-dependenciessrcSDL2VisualCteststestsurroundtestsurround.vcxproj" (default target
  1341. s).
  1342.  
  1343. Done Building Project "Z:bzflag-dependenciessrcSDL2VisualCSDL.sln" (default targets).
  1344.  
  1345.  
  1346. Build succeeded.
  1347.     0 Warning(s)
  1348.     0 Error(s)
  1349.  
  1350. Time Elapsed 00:03:32.93
  1351.         1 file(s) copied.
  1352.         1 file(s) copied.
  1353.         1 file(s) copied.
  1354.         1 file(s) copied.
  1355. includebegin_code.h
  1356. includeclose_code.h
  1357. includeSDL.h
  1358. includeSDL_assert.h
  1359. includeSDL_atomic.h
  1360. includeSDL_audio.h
  1361. includeSDL_bits.h
  1362. includeSDL_blendmode.h
  1363. includeSDL_clipboard.h
  1364. includeSDL_config.h
  1365. includeSDL_config_android.h
  1366. includeSDL_config_emscripten.h
  1367. includeSDL_config_iphoneos.h
  1368. includeSDL_config_macosx.h
  1369. includeSDL_config_minimal.h
  1370. includeSDL_config_ngage.h
  1371. includeSDL_config_os2.h
  1372. includeSDL_config_pandora.h
  1373. includeSDL_config_windows.h
  1374. includeSDL_config_wingdk.h
  1375. includeSDL_config_winrt.h
  1376. includeSDL_config_xbox.h
  1377. includeSDL_copying.h
  1378. includeSDL_cpuinfo.h
  1379. includeSDL_egl.h
  1380. includeSDL_endian.h
  1381. includeSDL_error.h
  1382. includeSDL_events.h
  1383. includeSDL_filesystem.h
  1384. includeSDL_gamecontroller.h
  1385. includeSDL_gesture.h
  1386. includeSDL_guid.h
  1387. includeSDL_haptic.h
  1388. includeSDL_hidapi.h
  1389. includeSDL_hints.h
  1390. includeSDL_joystick.h
  1391. includeSDL_keyboard.h
  1392. includeSDL_keycode.h
  1393. includeSDL_loadso.h
  1394. includeSDL_locale.h
  1395. includeSDL_log.h
  1396. includeSDL_main.h
  1397. includeSDL_messagebox.h
  1398. includeSDL_metal.h
  1399. includeSDL_misc.h
  1400. includeSDL_mouse.h
  1401. includeSDL_mutex.h
  1402. includeSDL_name.h
  1403. includeSDL_opengl.h
  1404. includeSDL_opengles.h
  1405. includeSDL_opengles2.h
  1406. includeSDL_opengles2_gl2.h
  1407. includeSDL_opengles2_gl2ext.h
  1408. includeSDL_opengles2_gl2platform.h
  1409. includeSDL_opengles2_khrplatform.h
  1410. includeSDL_opengl_glext.h
  1411. includeSDL_pixels.h
  1412. includeSDL_platform.h
  1413. includeSDL_power.h
  1414. includeSDL_quit.h
  1415. includeSDL_rect.h
  1416. includeSDL_render.h
  1417. includeSDL_revision.h
  1418. includeSDL_rwops.h
  1419. includeSDL_scancode.h
  1420. includeSDL_sensor.h
  1421. includeSDL_shape.h
  1422. includeSDL_stdinc.h
  1423. includeSDL_surface.h
  1424. includeSDL_system.h
  1425. includeSDL_syswm.h
  1426. includeSDL_test.h
  1427. includeSDL_test_assert.h
  1428. includeSDL_test_common.h
  1429. includeSDL_test_compare.h
  1430. includeSDL_test_crc32.h
  1431. includeSDL_test_font.h
  1432. includeSDL_test_fuzzer.h
  1433. includeSDL_test_harness.h
  1434. includeSDL_test_images.h
  1435. includeSDL_test_log.h
  1436. includeSDL_test_md5.h
  1437. includeSDL_test_memory.h
  1438. includeSDL_test_random.h
  1439. includeSDL_thread.h
  1440. includeSDL_timer.h
  1441. includeSDL_touch.h
  1442. includeSDL_types.h
  1443. includeSDL_version.h
  1444. includeSDL_video.h
  1445. includeSDL_vulkan.h
  1446.        91 file(s) copied.
  1447.         1 file(s) copied.
  1448.  
  1449.  
  1450. #######################
  1451. # Final build results #
  1452. #######################
  1453.  
  1454. PDCurses ............... SUCCESS!
  1455. zlib ................... FAILED!
  1456. c-ares ................. SUCCESS!
  1457. curl ................... FAILED!
  1458. regex .................. SUCCESS!
  1459. GLEW ................... SUCCESS!
  1460. SDL2 ................... SUCCESS!
  1461. ==============================
  1462. Building PDCurses
  1463. ==============================
  1464.  
  1465. Microsoft (R) Program Maintenance Utility Version 14.16.27050.0
  1466. Copyright (C) Microsoft Corporation.  All rights reserved.
  1467.  
  1468. 'pdcurses.lib' is up-to-date
  1469. winconpdcurses.lib
  1470.         1 file(s) copied.
  1471. curses.h
  1472. curspriv.h
  1473. panel.h
  1474.         3 file(s) copied.
  1475.         1 file(s) copied.
  1476.  
  1477. ==============================
  1478. Building zlib
  1479. ==============================
  1480.  
  1481. Microsoft (R) Program Maintenance Utility Version 14.16.27050.0
  1482. Copyright (C) Microsoft Corporation.  All rights reserved.
  1483.  
  1484.         link -nologo -debug -incremental:no -opt:ref -def:./win32/zlib.def -dll -implib:zdll.lib  -out:zlib1.dll -base:0x5A4C0000 adler32.obj compress.obj crc32.obj deflate.obj gzclose.obj gzlib.obj gzread.obj  gzwrite.obj infback.obj inflate.obj inftrees.obj inffast.obj trees.obj uncompr.obj zutil.obj  zlib1.res
  1485.    Creating library zdll.lib and object zdll.exp
  1486. LINK : fatal error LNK1207: incompatible PDB format in 'Z:bzflag-dependenciessrczlibzlib1.pdb'; delete and rebuild
  1487. NMAKE : fatal error U1077: '"C:Program Files (x86)Microsoft Visual Studio2017EnterpriseVCToolsMSVC14.16.27023binHostX86x86link.EXE"' : return code '0x4b7'
  1488. Stop.
  1489.  
  1490. ==============================
  1491. Building c-ares
  1492. ==============================
  1493.  
  1494. Microsoft (R) Program Maintenance Utility Version 14.16.27050.0
  1495. Copyright (C) Microsoft Corporation.  All rights reserved.
  1496.  
  1497.         link.exe /dll /nologo /incremental:no /fixed:no /debug ws2_32.lib advapi32.lib kernel32.lib iphlpapi.lib /implib:.msvccaresdll-debugcaresd.lib /pdb:.msvccaresdll-debugcaresd.pdb  /out:.msvccaresdll-debugcaresd.dll .msvccaresdll-debugobjares__addrinfo2hostent.obj .msvccaresdll-debugobjares__addrinfo_localhost.obj .msvccaresdll-debugobjares__close_sockets.obj .msvccaresdll-debugobjares__get_hostent.obj .msvccaresdll-debugobjares__parse_into_addrinfo.obj .msvccaresdll-debugobjares__readaddrinfo.obj .msvccaresdll-debugobjares__sortaddrinfo.obj .msvccaresdll-debugobjares__read_line.obj .msvccaresdll-debugobjares__timeval.obj .msvccaresdll-debugobjares_android.obj .msvccaresdll-debugobjares_cancel.obj .msvccaresdll-debugobjares_data.obj .msvccaresdll-debugobjares_destroy.obj .msvccaresdll-debugobjares_expand_name.obj .msvccaresdll-debugobjares_expand_string.obj .msvccaresdll-debugobjares_fds.obj .msvccaresdll-debugobjares_free_hostent.obj .msvccaresdll-debugobjares_free_string.obj .msvccaresdll-debugobjares_freeaddrinfo.obj .msvccaresdll-debugobjares_getaddrinfo.obj .msvccaresdll-debugobjares_getenv.obj .msvccaresdll-debugobjares_gethostbyaddr.obj .msvccaresdll-debugobjares_gethostbyname.obj .msvccaresdll-debugobjares_getnameinfo.obj .msvccaresdll-debugobjares_getsock.obj .msvccaresdll-debugobjares_init.obj .msvccaresdll-debugobjares_library_init.obj .msvccaresdll-debugobjares_llist.obj .msvccaresdll-debugobjares_mkquery.obj .msvccaresdll-debugobjares_create_query.obj .msvccaresdll-debugobjares_nowarn.obj .msvccaresdll-debugobjares_options.obj .msvccaresdll-debugobjares_parse_a_reply.obj .msvccaresdll-debugobjares_parse_aaaa_reply.obj .msvccaresdll-debugobjares_parse_caa_reply.obj .msvccaresdll-debugobjares_parse_mx_reply.obj .msvccaresdll-debugobjares_parse_naptr_reply.obj .msvccaresdll-debugobjares_parse_ns_reply.obj .msvccaresdll-debugobjares_parse_ptr_reply.obj .msvccaresdll-debugobjares_parse_soa_reply.obj .msvccaresdll-debugobjares_parse_srv_reply.obj .msvccaresdll-debugobjares_parse_txt_reply.obj .msvccaresdll-debugobjares_parse_uri_reply.obj .msvccaresdll-debugobjares_platform.obj .msvccaresdll-debugobjares_process.obj .msvccaresdll-debugobjares_query.obj .msvccaresdll-debugobjares_rand.obj .msvccaresdll-debugobjares_search.obj .msvccaresdll-debugobjares_send.obj .msvccaresdll-debugobjares_strcasecmp.obj .msvccaresdll-debugobjares_strdup.obj .msvccaresdll-debugobjares_strerror.obj .msvccaresdll-debugobjares_strsplit.obj .msvccaresdll-debugobjares_timeout.obj .msvccaresdll-debugobjares_version.obj .msvccaresdll-debugobjares_writev.obj .msvccaresdll-debugobjbitncmp.obj .msvccaresdll-debugobjinet_net_pton.obj .msvccaresdll-debugobjinet_ntop.obj .msvccaresdll-debugobjwindows_port.obj .msvccaresdll-debugobjcares.res
  1498.    Creating library .msvccaresdll-debugcaresd.lib and object .msvccaresdll-debugcaresd.exp
  1499. includeares.h
  1500. includeares_build.h
  1501. includeares_dns.h
  1502. includeares_nameser.h
  1503. includeares_rules.h
  1504. includeares_version.h
  1505.         6 file(s) copied.
  1506. msvccaresdll-debugcaresd.dll
  1507.         1 file(s) copied.
  1508. msvccaresdll-debugcaresd.lib
  1509.         1 file(s) copied.
  1510. msvccaresdll-debugcaresd.exp
  1511.         1 file(s) copied.
  1512.         1 file(s) copied.
  1513.  
  1514. ==============================
  1515. Building libcurl
  1516. ==============================
  1517.  
  1518. Microsoft (R) Program Maintenance Utility Version 14.16.27050.0
  1519. Copyright (C) Microsoft Corporation.  All rights reserved.
  1520.  
  1521. configuration name: libcurl-vc15-x86-debug-dll-cares-dll-zlib-dll-ipv6-sspi-schannel
  1522.         cl /Od /D_DEBUG /RTC1 /Z7 /LDd /MDd /I. /I ../lib /I../include /nologo /W4 /EHsc /DWIN32 /FD /c /DBUILDING_LIBCURL /I"Z:bzflag-dependenciesoutput-debug-x86/include" /DUSE_ARES /I"Z:bzflag-dependenciesoutput-debug-x86/include/cares" /DHAVE_LIBZ  /I"Z:bzflag-dependenciesoutput-debug-x86/include"  /DUSE_IPV6  /DUSE_WINDOWS_SSPI /DUSE_SCHANNEL /Fo"..buildslibcurl-vc15-x86-debug-dll-cares-dll-zlib-dll-ipv6-sspi-schannel-obj-lib"  ..libcontent_encoding.c ..libversion.c
  1523. content_encoding.c
  1524. ..libcontent_encoding.c(32): fatal error C1083: Cannot open include file: 'zlib.h': No such file or directory
  1525. version.c
  1526. ..libversion.c(61): fatal error C1083: Cannot open include file: 'zlib.h': No such file or directory
  1527. Generating Code...
  1528. NMAKE : fatal error U1077: '"C:Program Files (x86)Microsoft Visual Studio2017EnterpriseVCToolsMSVC14.16.27023binHostX86x86cl.EXE"' : return code '0x2'
  1529. Stop.
  1530. NMAKE : fatal error U1077: '"C:Program Files (x86)Microsoft Visual Studio2017EnterpriseVCToolsMSVC14.16.27023binHostX86x86nmake.exe"' : return code '0x2'
  1531. Stop.
  1532.  
  1533. ==============================
  1534. Building regex
  1535. ==============================
  1536. Microsoft (R) Build Engine version 15.9.21+g9802d43bc3 for .NET Framework
  1537. Copyright (C) Microsoft Corporation. All rights reserved.
  1538.  
  1539. Building the projects in this solution one at a time. To enable parallel build, please add the "/m" switch.
  1540. Build started 1/9/2023 17:40:42.
  1541. Project "Z:bzflag-dependenciessrcregexregex.sln" on node 1 (default targets).
  1542. ValidateSolutionConfiguration:
  1543.   Building solution configuration "debug|Win32".
  1544. Project "Z:bzflag-dependenciessrcregexregex.sln" (1) is building "Z:bzflag-dependenciessrcregexregex.vcxproj" (
  1545. 2) on node 1 (default targets).
  1546. InitializeBuildStatus:
  1547.   Creating "./regex_Win32_Debugregex.tlogunsuccessfulbuild" because "AlwaysCreate" was specified.
  1548. ClCompile:
  1549.   All outputs are up-to-date.
  1550. Lib:
  1551.   All outputs are up-to-date.
  1552.   regex.vcxproj -> Z:bzflag-dependenciessrcregex./regex_Win32_Debugregex.lib
  1553. BscMake:
  1554.   All outputs are up-to-date.
  1555. FinalizeBuildStatus:
  1556.   Deleting file "./regex_Win32_Debugregex.tlogunsuccessfulbuild".
  1557.   Touching "./regex_Win32_Debugregex.tlogregex.lastbuildstate".
  1558. Done Building Project "Z:bzflag-dependenciessrcregexregex.vcxproj" (default targets).
  1559.  
  1560. Done Building Project "Z:bzflag-dependenciessrcregexregex.sln" (default targets).
  1561.  
  1562.  
  1563. Build succeeded.
  1564.     0 Warning(s)
  1565.     0 Error(s)
  1566.  
  1567. Time Elapsed 00:00:01.71
  1568.         1 file(s) copied.
  1569.         1 file(s) copied.
  1570.         1 file(s) copied.
  1571.  
  1572. ==============================
  1573. Building GLEW
  1574. ==============================
  1575. Microsoft (R) Build Engine version 15.9.21+g9802d43bc3 for .NET Framework
  1576. Copyright (C) Microsoft Corporation. All rights reserved.
  1577.  
  1578. Building the projects in this solution one at a time. To enable parallel build, please add the "/m" switch.
  1579. Build started 1/9/2023 17:40:44.
  1580. Project "Z:bzflag-dependenciessrcglewbuildvc12glew.sln" on node 1 (default targets).
  1581. ValidateSolutionConfiguration:
  1582.   Building solution configuration "debug|Win32".
  1583. Project "Z:bzflag-dependenciessrcglewbuildvc12glew.sln" (1) is building "Z:bzflag-dependenciessrcglewbuildvc
  1584. 12glew_shared.vcxproj" (2) on node 1 (default targets).
  1585. InitializeBuildStatus:
  1586.   Creating "tmpglew_sharedDebugWin32glew_shared.tlogunsuccessfulbuild" because "AlwaysCreate" was specified.
  1587. ClCompile:
  1588.   All outputs are up-to-date.
  1589. ResourceCompile:
  1590.   All outputs are up-to-date.
  1591. Link:
  1592.   All outputs are up-to-date.
  1593.   glew_shared.vcxproj -> Z:bzflag-dependenciessrcglewbuildvc12....binDebugWin32glew32d.dll
  1594. FinalizeBuildStatus:
  1595.   Deleting file "tmpglew_sharedDebugWin32glew_shared.tlogunsuccessfulbuild".
  1596.   Touching "tmpglew_sharedDebugWin32glew_shared.tlogglew_shared.lastbuildstate".
  1597. Done Building Project "Z:bzflag-dependenciessrcglewbuildvc12glew_shared.vcxproj" (default targets).
  1598.  
  1599. Project "Z:bzflag-dependenciessrcglewbuildvc12glew.sln" (1) is building "Z:bzflag-dependenciessrcglewbuildvc
  1600. 12glew_static.vcxproj" (3) on node 1 (default targets).
  1601. InitializeBuildStatus:
  1602.   Creating "tmpglew_staticDebugWin32glew_static.tlogunsuccessfulbuild" because "AlwaysCreate" was specified.
  1603. ClCompile:
  1604.   All outputs are up-to-date.
  1605. ResourceCompile:
  1606.   All outputs are up-to-date.
  1607. Lib:
  1608.   All outputs are up-to-date.
  1609.   glew_static.vcxproj -> Z:bzflag-dependenciessrcglewbuildvc12....libDebugWin32glew32sd.lib
  1610. FinalizeBuildStatus:
  1611.   Deleting file "tmpglew_staticDebugWin32glew_static.tlogunsuccessfulbuild".
  1612.   Touching "tmpglew_staticDebugWin32glew_static.tlogglew_static.lastbuildstate".
  1613. Done Building Project "Z:bzflag-dependenciessrcglewbuildvc12glew_static.vcxproj" (default targets).
  1614.  
  1615. Project "Z:bzflag-dependenciessrcglewbuildvc12glew.sln" (1) is building "Z:bzflag-dependenciessrcglewbuildvc
  1616. 12glewinfo.vcxproj" (4) on node 1 (default targets).
  1617. InitializeBuildStatus:
  1618.   Creating "tmpglewinfoDebugWin32glewinfo.tlogunsuccessfulbuild" because "AlwaysCreate" was specified.
  1619. ClCompile:
  1620.   All outputs are up-to-date.
  1621. ResourceCompile:
  1622.   All outputs are up-to-date.
  1623. Link:
  1624.   All outputs are up-to-date.
  1625.   glewinfo.vcxproj -> Z:bzflag-dependenciessrcglewbuildvc12....binDebugWin32glewinfod.exe
  1626. FinalizeBuildStatus:
  1627.   Deleting file "tmpglewinfoDebugWin32glewinfo.tlogunsuccessfulbuild".
  1628.   Touching "tmpglewinfoDebugWin32glewinfo.tlogglewinfo.lastbuildstate".
  1629. Done Building Project "Z:bzflag-dependenciessrcglewbuildvc12glewinfo.vcxproj" (default targets).
  1630.  
  1631. Project "Z:bzflag-dependenciessrcglewbuildvc12glew.sln" (1) is building "Z:bzflag-dependenciessrcglewbuildvc
  1632. 12visualinfo.vcxproj" (5) on node 1 (default targets).
  1633. InitializeBuildStatus:
  1634.   Creating "tmpvisualinfoDebugWin32visualinfo.tlogunsuccessfulbuild" because "AlwaysCreate" was specified.
  1635. ClCompile:
  1636.   All outputs are up-to-date.
  1637. ResourceCompile:
  1638.   All outputs are up-to-date.
  1639. Link:
  1640.   All outputs are up-to-date.
  1641.   visualinfo.vcxproj -> Z:bzflag-dependenciessrcglewbuildvc12....binDebugWin32visualinfod.exe
  1642. FinalizeBuildStatus:
  1643.   Deleting file "tmpvisualinfoDebugWin32visualinfo.tlogunsuccessfulbuild".
  1644.   Touching "tmpvisualinfoDebugWin32visualinfo.tlogvisualinfo.lastbuildstate".
  1645. Done Building Project "Z:bzflag-dependenciessrcglewbuildvc12visualinfo.vcxproj" (default targets).
  1646.  
  1647. Done Building Project "Z:bzflag-dependenciessrcglewbuildvc12glew.sln" (default targets).
  1648.  
  1649.  
  1650. Build succeeded.
  1651.     0 Warning(s)
  1652.     0 Error(s)
  1653.  
  1654. Time Elapsed 00:00:02.43
  1655. libdebugWin32glew32d.exp
  1656.         1 file(s) copied.
  1657. libdebugWin32glew32sd.lib
  1658.         1 file(s) copied.
  1659. bindebugWin32glew32d.pdb
  1660. bindebugWin32glewinfod.pdb
  1661. bindebugWin32visualinfod.pdb
  1662.         3 file(s) copied.
  1663. includeGLeglew.h
  1664. includeGLglew.h
  1665. includeGLglxew.h
  1666. includeGLwglew.h
  1667.         4 file(s) copied.
  1668.         1 file(s) copied.
  1669.  
  1670. ==============================
  1671. Building SDL2
  1672. ==============================
  1673. Microsoft (R) Build Engine version 15.9.21+g9802d43bc3 for .NET Framework
  1674. Copyright (C) Microsoft Corporation. All rights reserved.
  1675.  
  1676. Building the projects in this solution one at a time. To enable parallel build, please add the "/m" switch.
  1677. Build started 1/9/2023 17:40:48.
  1678. Project "Z:bzflag-dependenciessrcSDL2VisualCSDL.sln" on node 1 (default targets).
  1679. ValidateSolutionConfiguration:
  1680.   Building solution configuration "debug|Win32".
  1681. Project "Z:bzflag-dependenciessrcSDL2VisualCSDL.sln" (1) is building "Z:bzflag-dependenciessrcSDL2VisualCSDL
  1682. SDL.vcxproj" (2) on node 1 (default targets).
  1683. InitializeBuildStatus:
  1684.   Touching "Win32DebugSDL2.tlogunsuccessfulbuild".
  1685. ClCompile:
  1686.   All outputs are up-to-date.
  1687. ResourceCompile:
  1688.   All outputs are up-to-date.
  1689. Link:
  1690.   C:Program Files (x86)Microsoft Visual Studio2017EnterpriseVCToolsMSVC14.16.27023binHostX86x86link.exe /ER
  1691.   RORREPORT:QUEUE /OUT:"Z:bzflag-dependenciessrcSDL2VisualCWin32DebugSDL2.dll" /NOLOGO setupapi.lib winmm.lib im
  1692.   m32.lib version.lib kernel32.lib user32.lib gdi32.lib winspool.lib comdlg32.lib advapi32.lib shell32.lib ole32.lib ol
  1693.   eaut32.lib uuid.lib odbc32.lib odbccp32.lib /NODEFAULTLIB /MANIFEST /MANIFESTUAC:"level='asInvoker' uiAccess='false'"
  1694.    /manifest:embed /DEBUG /PDB:"Z:bzflag-dependenciessrcSDL2VisualCWin32DebugSDL2.pdb" /SUBSYSTEM:WINDOWS /TLBID
  1695.   :1 /DYNAMICBASE /NXCOMPAT /IMPLIB:"Z:bzflag-dependenciessrcSDL2VisualCWin32DebugSDL2.lib" /MACHINE:X86 /SAFESE
  1696.   H /DLL Win32Debugversion.res
  1697.   Win32DebugSDL_guid.obj
  1698.   Win32DebugSDL_atomic.obj
  1699.   Win32DebugSDL_spinlock.obj
  1700.   Win32DebugSDL_directsound.obj
  1701.   Win32DebugSDL_diskaudio.obj
  1702.   Win32DebugSDL_dummyaudio.obj
  1703.   Win32DebugSDL_audio.obj
  1704.   Win32DebugSDL_audiocvt.obj
  1705.   Win32DebugSDL_audiodev.obj
  1706.   Win32DebugSDL_audiotypecvt.obj
  1707.   Win32DebugSDL_mixer.obj
  1708.   Win32DebugSDL_wave.obj
  1709.   Win32DebugSDL_winmm.obj
  1710.   Win32DebugSDL_wasapi.obj
  1711.   Win32DebugSDL_wasapi_win32.obj
  1712.   Win32DebugSDL_hid.obj
  1713.   Win32DebugSDL_immdevice.obj
  1714.   Win32DebugSDL_windows.obj
  1715.   Win32DebugSDL_xinput.obj
  1716.   Win32DebugSDL_cpuinfo.obj
  1717.   Win32DebugSDL_dynapi.obj
  1718.   Win32DebugSDL_clipboardevents.obj
  1719.   Win32DebugSDL_displayevents.obj
  1720.   Win32DebugSDL_dropevents.obj
  1721.   Win32DebugSDL_events.obj
  1722.   Win32DebugSDL_gesture.obj
  1723.   Win32DebugSDL_keyboard.obj
  1724.   Win32DebugSDL_mouse.obj
  1725.   Win32DebugSDL_quit.obj
  1726.   Win32DebugSDL_touch.obj
  1727.   Win32DebugSDL_windowevents.obj
  1728.   Win32DebugSDL_rwops.obj
  1729.   Win32DebugSDL_sysfilesystem.obj
  1730.   Win32DebugSDL_syshaptic.obj
  1731.   Win32DebugSDL_haptic.obj
  1732.   Win32DebugSDL_dinputhaptic.obj
  1733.   Win32DebugSDL_windowshaptic.obj
  1734.   Win32DebugSDL_xinputhaptic.obj
  1735.   Win32DebugSDL_hidapi.obj
  1736.   Win32Debugcontroller_type.obj
  1737.   Win32DebugSDL_sysjoystick.obj
  1738.   Win32DebugSDL_hidapijoystick.obj
  1739.   Win32DebugSDL_hidapi_combined.obj
  1740.   Win32DebugSDL_hidapi_gamecube.obj
  1741.   Win32DebugSDL_hidapi_luna.obj
  1742.   Win32DebugSDL_hidapi_ps3.obj
  1743.   Win32DebugSDL_hidapi_ps4.obj
  1744.   Win32DebugSDL_hidapi_ps5.obj
  1745.   Win32DebugSDL_hidapi_rumble.obj
  1746.   Win32DebugSDL_hidapi_shield.obj
  1747.   Win32DebugSDL_hidapi_stadia.obj
  1748.   Win32DebugSDL_hidapi_steam.obj
  1749.   Win32DebugSDL_hidapi_switch.obj
  1750.   Win32DebugSDL_hidapi_wii.obj
  1751.   Win32DebugSDL_hidapi_xbox360.obj
  1752.   Win32DebugSDL_hidapi_xbox360w.obj
  1753.   Win32DebugSDL_hidapi_xboxone.obj
  1754.   Win32DebugSDL_gamecontroller.obj
  1755.   Win32DebugSDL_joystick.obj
  1756.   Win32DebugSDL_virtualjoystick.obj
  1757.   Win32DebugSDL_dinputjoystick.obj
  1758.   Win32DebugSDL_rawinputjoystick.obj
  1759.   Win32DebugSDL_windowsjoystick.obj
  1760.   Win32DebugSDL_windows_gaming_input.obj
  1761.   Win32DebugSDL_xinputjoystick.obj
  1762.   Win32Debuge_atan2.obj
  1763.   Win32Debuge_exp.obj
  1764.   Win32Debuge_fmod.obj
  1765.   Win32Debuge_log.obj
  1766.   Win32Debuge_log10.obj
  1767.   Win32Debuge_pow.obj
  1768.   Win32Debuge_rem_pio2.obj
  1769.   Win32Debuge_sqrt.obj
  1770.   Win32Debugk_cos.obj
  1771.   Win32Debugk_rem_pio2.obj
  1772.   Win32Debugk_sin.obj
  1773.   Win32Debugk_tan.obj
  1774.   Win32Debugs_atan.obj
  1775.   Win32Debugs_copysign.obj
  1776.   Win32Debugs_cos.obj
  1777.   Win32Debugs_fabs.obj
  1778.   Win32Debugs_floor.obj
  1779.   Win32Debugs_scalbn.obj
  1780.   Win32Debugs_sin.obj
  1781.   Win32Debugs_tan.obj
  1782.   Win32DebugSDL_sysloadso.obj
  1783.   Win32DebugSDL_locale.obj
  1784.   Win32DebugSDL_syslocale.obj
  1785.   Win32DebugSDL_url.obj
  1786.   Win32DebugSDL_sysurl.obj
  1787.   Win32DebugSDL_power.obj
  1788.   Win32DebugSDL_syspower.obj
  1789.   Win32DebugSDL_shaders_d3d11.obj
  1790.   Win32DebugSDL_render_d3d12.obj
  1791.   Win32DebugSDL_shaders_d3d12.obj
  1792.   Win32DebugSDL_render_d3d.obj
  1793.   Win32DebugSDL_render_d3d11.obj
  1794.   Win32DebugSDL_shaders_d3d.obj
  1795.   Win32DebugSDL_render_gl.obj
  1796.   Win32DebugSDL_shaders_gl.obj
  1797.   Win32DebugSDL_render_gles2.obj
  1798.   Win32DebugSDL_shaders_gles2.obj
  1799.   Win32DebugSDL_d3dmath.obj
  1800.   Win32DebugSDL_render.obj
  1801.   Win32DebugSDL_yuv_sw.obj
  1802.   Win32DebugSDL_blendfillrect.obj
  1803.   Win32DebugSDL_blendline.obj
  1804.   Win32DebugSDL_blendpoint.obj
  1805.   Win32DebugSDL_drawline.obj
  1806.   Win32DebugSDL_drawpoint.obj
  1807.   Win32DebugSDL_render_sw.obj
  1808.   Win32DebugSDL_rotate.obj
  1809.   Win32DebugSDL_triangle.obj
  1810.   Win32DebugSDL.obj
  1811.   Win32DebugSDL_assert.obj
  1812.   Win32DebugSDL_dataqueue.obj
  1813.   Win32DebugSDL_list.obj
  1814.   Win32DebugSDL_error.obj
  1815.   Win32DebugSDL_hints.obj
  1816.   Win32DebugSDL_log.obj
  1817.   Win32DebugSDL_utils.obj
  1818.   Win32DebugSDL_dummysensor.obj
  1819.   Win32DebugSDL_sensor.obj
  1820.   Win32DebugSDL_windowssensor.obj
  1821.   Win32DebugSDL_crc16.obj
  1822.   Win32DebugSDL_crc32.obj
  1823.   Win32DebugSDL_getenv.obj
  1824.   Win32DebugSDL_iconv.obj
  1825.   Win32DebugSDL_malloc.obj
  1826.   Win32DebugSDL_mslibc.obj
  1827.   Win32DebugSDL_qsort.obj
  1828.   Win32DebugSDL_stdlib.obj
  1829.   Win32DebugSDL_string.obj
  1830.   Win32DebugSDL_strtokr.obj
  1831.   Win32DebugSDL_syscond.obj
  1832.   Win32DebugSDL_thread.obj
  1833.   Win32DebugSDL_syscond_cv.obj
  1834.   Win32DebugSDL_sysmutex.obj
  1835.   Win32DebugSDL_syssem.obj
  1836.   Win32DebugSDL_systhread.obj
  1837.   Win32DebugSDL_systls.obj
  1838.   Win32DebugSDL_timer.obj
  1839.   Win32DebugSDL_systimer.obj
  1840.   Win32DebugSDL_nullevents.obj
  1841.   Win32DebugSDL_nullframebuffer.obj
  1842.   Win32DebugSDL_nullvideo.obj
  1843.   Win32DebugSDL_blit.obj
  1844.   Win32DebugSDL_blit_0.obj
  1845.   Win32DebugSDL_blit_1.obj
  1846.   Win32DebugSDL_blit_A.obj
  1847.   Win32DebugSDL_blit_auto.obj
  1848.   Win32DebugSDL_blit_copy.obj
  1849.   Win32DebugSDL_blit_N.obj
  1850.   Win32DebugSDL_blit_slow.obj
  1851.   Win32DebugSDL_bmp.obj
  1852.   Win32DebugSDL_clipboard.obj
  1853.   Win32DebugSDL_egl.obj
  1854.   Win32DebugSDL_fillrect.obj
  1855.   Win32DebugSDL_pixels.obj
  1856.   Win32DebugSDL_rect.obj
  1857.   Win32DebugSDL_RLEaccel.obj
  1858.   Win32DebugSDL_shape.obj
  1859.   Win32DebugSDL_stretch.obj
  1860.   Win32DebugSDL_surface.obj
  1861.   Win32DebugSDL_video.obj
  1862.   Win32DebugSDL_vulkan_utils.obj
  1863.   Win32DebugSDL_yuv.obj
  1864.   Win32DebugSDL_windowsclipboard.obj
  1865.   Win32DebugSDL_windowsevents.obj
  1866.   Win32DebugSDL_windowsframebuffer.obj
  1867.   Win32DebugSDL_windowskeyboard.obj
  1868.   Win32DebugSDL_windowsmessagebox.obj
  1869.   Win32DebugSDL_windowsmodes.obj
  1870.   Win32DebugSDL_windowsmouse.obj
  1871.   Win32DebugSDL_windowsopengl.obj
  1872.   Win32DebugSDL_windowsopengles.obj
  1873.   Win32DebugSDL_windowsshape.obj
  1874.   Win32DebugSDL_windowsvideo.obj
  1875.   Win32DebugSDL_windowsvulkan.obj
  1876.   Win32DebugSDL_windowswindow.obj
  1877.   Win32Debugyuv_rgb.obj
  1878.      Creating library Z:bzflag-dependenciessrcSDL2VisualCWin32DebugSDL2.lib and object Z:bzflag-dependenciessr
  1879.   cSDL2VisualCWin32DebugSDL2.exp
  1880. LINK : fatal error LNK1207: incompatible PDB format in 'Z:bzflag-dependenciessrcSDL2VisualCWin32DebugSDL2.pdb';
  1881. delete and rebuild [Z:bzflag-dependenciessrcSDL2VisualCSDLSDL.vcxproj]
  1882. Done Building Project "Z:bzflag-dependenciessrcSDL2VisualCSDLSDL.vcxproj" (default targets) -- FAILED.
  1883.  
  1884. Project "Z:bzflag-dependenciessrcSDL2VisualCSDL.sln" (1) is building "Z:bzflag-dependenciessrcSDL2VisualCSDLm
  1885. ainSDLmain.vcxproj" (3) on node 1 (default targets).
  1886. InitializeBuildStatus:
  1887.   Creating "Win32DebugSDL2main.tlogunsuccessfulbuild" because "AlwaysCreate" was specified.
  1888. ClCompile:
  1889.   All outputs are up-to-date.
  1890. Lib:
  1891.   All outputs are up-to-date.
  1892.   SDLmain.vcxproj -> Z:bzflag-dependenciessrcSDL2VisualCWin32DebugSDL2main.lib
  1893. FinalizeBuildStatus:
  1894.   Deleting file "Win32DebugSDL2main.tlogunsuccessfulbuild".
  1895.   Touching "Win32DebugSDL2main.tlogSDL2main.lastbuildstate".
  1896. Done Building Project "Z:bzflag-dependenciessrcSDL2VisualCSDLmainSDLmain.vcxproj" (default targets).
  1897.  
  1898. Project "Z:bzflag-dependenciessrcSDL2VisualCSDL.sln" (1) is building "Z:bzflag-dependenciessrcSDL2VisualCtest
  1899. scheckkeyscheckkeys.vcxproj" (4) on node 1 (default targets).
  1900. Project "Z:bzflag-dependenciessrcSDL2VisualCtestscheckkeyscheckkeys.vcxproj" (4) is building "Z:bzflag-dependen
  1901. ciessrcSDL2VisualCSDLtestSDLtest.vcxproj" (5) on node 1 (default targets).
  1902. InitializeBuildStatus:
  1903.   Creating "Win32DebugSDL2test.tlogunsuccessfulbuild" because "AlwaysCreate" was specified.
  1904. ClCompile:
  1905.   All outputs are up-to-date.
  1906. Lib:
  1907.   All outputs are up-to-date.
  1908.   SDLtest.vcxproj -> Z:bzflag-dependenciessrcSDL2VisualCWin32DebugSDL2test.lib
  1909. FinalizeBuildStatus:
  1910.   Deleting file "Win32DebugSDL2test.tlogunsuccessfulbuild".
  1911.   Touching "Win32DebugSDL2test.tlogSDL2test.lastbuildstate".
  1912. Done Building Project "Z:bzflag-dependenciessrcSDL2VisualCSDLtestSDLtest.vcxproj" (default targets).
  1913.  
  1914. Done Building Project "Z:bzflag-dependenciessrcSDL2VisualCtestscheckkeyscheckkeys.vcxproj" (default targets) --
  1915. FAILED.
  1916.  
  1917. Done Building Project "Z:bzflag-dependenciessrcSDL2VisualCSDL.sln" (default targets) -- FAILED.
  1918.  
  1919.  
  1920. Build FAILED.
  1921.  
  1922. "Z:bzflag-dependenciessrcSDL2VisualCSDL.sln" (default target) (1) ->
  1923. "Z:bzflag-dependenciessrcSDL2VisualCSDLSDL.vcxproj" (default target) (2) ->
  1924. (Link target) ->
  1925.   LINK : fatal error LNK1207: incompatible PDB format in 'Z:bzflag-dependenciessrcSDL2VisualCWin32DebugSDL2.pdb'
  1926. ; delete and rebuild [Z:bzflag-dependenciessrcSDL2VisualCSDLSDL.vcxproj]
  1927.  
  1928.     0 Warning(s)
  1929.     1 Error(s)
  1930.  
  1931. Time Elapsed 00:00:20.09
  1932.  
  1933.  
  1934. #######################
  1935. # Final build results #
  1936. #######################
  1937.  
  1938. PDCurses ............... SUCCESS!
  1939. zlib ................... FAILED!
  1940. c-ares ................. SUCCESS!
  1941. curl ................... FAILED!
  1942. regex .................. SUCCESS!
  1943. GLEW ................... SUCCESS!
  1944. SDL2 ................... FAILED!
  1945. Press any key to continue . . .